{"text_format":"1","workbook":"xlsx","n_sheets":15,"sheets":["ZapRozh_4d","ZapRozh_6d","MužiZáp","ŽenyZáp","SenioriU_50Záp","SeniorkyU_50Záp","SenioriU_60Záp","SeniorkyU_60Záp","JunioriZáp","JuniorkyZáp","DorciZáp","DorkyZáp","ŽiaciZáp","ŽiačkykyZáp","VýsledSpolu"],"not_rendered":{"charts":0,"images":0,"macros":1,"external_links":6,"defined_names":641,"comments":0,"pivot_tables":0},"unopened":[],"bounds":{"document_bytes":16777216,"sheet_cells":100000,"rows_first":2000,"rows_last":500,"rows_between":2000,"halvings":0,"cell_chars":16384,"cell_head_chars":4096},"cells_cut":0,"cells_raw":0,"read":"whole","date_system":"1900"}

{"sheet":"ZapRozh_4d","index":0,"n_rows":239,"n_cols":16,"rows_kept":239,"cut":false,"hidden":false,"merged":[[3,3,3,8],[3,12,3,13],[22,11,23,11],[22,12,23,12],[10,5,11,5],[6,1,8,1],[6,8,8,8],[6,15,7,16],[8,15,8,17],[18,1,20,1],[18,8,20,8],[9,15,9,17],[10,1,11,2],[10,3,11,3],[10,4,11,4],[10,8,11,9],[10,10,11,10],[10,11,11,11],[22,1,23,2],[22,3,23,3],[22,4,23,4],[22,5,23,5],[22,8,23,9],[22,10,23,10],[10,12,11,12],[30,3,30,8],[30,12,30,13],[33,1,35,1],[33,8,35,8],[37,1,38,2],[37,3,38,3],[37,4,38,4],[37,5,38,5],[37,8,38,9],[37,10,38,10],[37,11,38,11],[37,12,38,12],[45,1,47,1],[45,8,47,8],[49,1,50,2],[49,3,50,3],[49,4,50,4],[49,5,50,5],[49,8,50,9],[49,10,50,10],[49,11,50,11],[49,12,50,12],[57,3,57,8],[57,12,57,13],[64,10,65,10],[64,11,65,11],[64,12,65,12],[60,1,62,1],[60,8,62,8],[64,1,65,2],[64,3,65,3],[64,4,65,4],[64,5,65,5],[64,8,65,9],[72,1,74,1],[72,8,74,8],[76,1,77,2],[76,3,77,3],[76,4,77,4],[76,5,77,5],[76,8,77,9],[76,10,77,10],[76,11,77,11],[76,12,77,12],[84,3,84,8],[84,12,84,13],[87,1,89,1],[87,8,89,8],[91,1,92,2],[91,3,92,3],[91,4,92,4],[91,5,92,5],[91,8,92,9],[91,10,92,10],[91,11,92,11],[91,12,92,12],[99,1,101,1],[99,8,101,8],[103,1,104,2],[103,3,104,3],[103,4,104,4],[103,5,104,5],[103,8,104,9],[103,10,104,10],[103,11,104,11],[103,12,104,12],[111,3,111,8],[111,12,111,13],[118,10,119,10],[118,11,119,11],[118,12,119,12],[114,1,116,1],[114,8,116,8],[118,1,119,2],[118,3,119,3],[118,4,119,4],[118,5,119,5],[118,8,119,9],[126,1,128,1],[126,8,128,8],[130,1,131,2],[130,3,131,3],[130,4,131,4],[130,5,131,5],[130,8,131,9],[130,10,131,10],[130,11,131,11],[130,12,131,12],[138,3,138,8],[138,12,138,13],[141,1,143,1],[141,8,143,8],[145,1,146,2],[145,3,146,3],[145,4,146,4],[145,5,146,5],[145,8,146,9],[145,10,146,10],[145,11,146,11],[145,12,146,12],[153,1,155,1],[153,8,155,8],[157,1,158,2],[157,3,158,3],[157,4,158,4],[157,5,158,5],[157,8,158,9],[157,10,158,10],[157,11,158,11],[157,12,158,12],[165,3,165,8],[165,12,165,13],[172,10,173,10],[172,11,173,11],[172,12,173,12],[168,1,170,1],[168,8,170,8],[172,1,173,2],[172,3,173,3],[172,4,173,4],[172,5,173,5],[172,8,173,9],[180,1,182,1],[180,8,182,8],[184,1,185,2],[184,3,185,3],[184,4,185,4],[184,5,185,5],[184,8,185,9],[184,10,185,10],[184,11,185,11],[184,12,185,12],[192,3,192,8],[192,12,192,13],[195,1,197,1],[195,8,197,8],[199,1,200,2],[199,3,200,3],[199,4,200,4],[199,5,200,5],[199,8,200,9],[199,10,200,10],[199,11,200,11],[199,12,200,12],[207,1,209,1],[207,8,209,8],[211,1,212,2],[211,3,212,3],[211,4,212,4],[211,5,212,5],[211,8,212,9],[211,10,212,10],[211,11,212,11],[211,12,212,12],[219,3,219,8],[219,12,219,13],[222,1,224,1],[222,8,224,8],[238,8,239,9],[238,10,239,10],[226,1,227,2],[226,3,227,3],[226,4,227,4],[226,5,227,5],[226,8,227,9],[226,10,227,10],[238,11,239,11],[238,12,239,12],[226,11,227,11],[226,12,227,12],[234,1,236,1],[234,8,236,8],[238,1,239,2],[238,3,239,3],[238,4,239,4],[238,5,239,5]]}
[]
[]
[]
[null,"Majstrovstvá kraja",null,"Prvá štvorka hráčov 1 - 4",null,null,null,null,null,null,null,null,{"$f":"TODAY()","v":"2019-04-10"}]
[]
[null,null,null,"Plné","Chyby","Cel_30","120 Hz.",null,null,null,"Plné","Chyby","Cel_30","120 Hz."]
[null,null,1,null,null,null,null,null,null,2,null,null,null,null,null,"  za 2."]
[null,null,2,null,null,null,null,null,null,1]
[null,null,4,null,null,null,null,null,null,3,null,null,null,null,null,"Pomocné zápisy"]
[null,null,3,null,null,null,null,null,null,4,null,null,null,null,null,"vytlačíš pre rozhodcu"]
[null,"Spolu :",null,null,null,null,null,null,"Spolu :"]
[]
[]
[]
[]
[]
[]
[null,null,null,"Plné","Chyby","Cel_30","120 Hz.",null,null,null,"Plné","Chyby","Cel_30","120 Hz."]
[null,null,3,null,null,null,null,null,null,4]
[null,null,4,null,null,null,null,null,null,3]
[null,null,2,null,null,null,null,null,null,1]
[null,null,1,null,null,null,null,null,null,2]
[null,"Spolu :",null,null,null,null,null,null,"Spolu :"]
[]
[]
[]
[]
[]
[]
[]
[null,{"$f":"$B$4","v":"Majstrovstvá kraja"},null,"Druhá štvorka hráčov 5 - 8",null,null,null,null,null,null,null,null,{"$f":"$M$4","v":"2019-04-10"}]
[]
[null,null,null,"Plné","Chyby","Cel_30","120 Hz.",null,null,null,"Plné","Chyby","Cel_30","120 Hz."]
[null,null,1,null,null,null,null,null,null,2]
[null,null,2,null,null,null,null,null,null,1]
[null,null,4,null,null,null,null,null,null,3]
[null,null,3,null,null,null,null,null,null,4]
[null,"Spolu :",null,null,null,null,null,null,"Spolu :"]
[]
[]
[]
[]
[]
[]
[null,null,null,"Plné","Chyby","Cel_30","120 Hz.",null,null,null,"Plné","Chyby","Cel_30","120 Hz."]
[null,null,3,null,null,null,null,null,null,4]
[null,null,4,null,null,null,null,null,null,3]
[null,null,2,null,null,null,null,null,null,1]
[null,null,1,null,null,null,null,null,null,2]
[null,"Spolu :",null,null,null,null,null,null,"Spolu :"]
[]
[]
[]
[]
[]
[]
[]
[null,{"$f":"$B$4","v":"Majstrovstvá kraja"},null,"Tretia štvorka hráčov 9 - 12",null,null,null,null,null,null,null,null,{"$f":"$M$4","v":"2019-04-10"}]
[]
[null,null,null,"Plné","Chyby","Cel_30","120 Hz.",null,null,null,"Plné","Chyby","Cel_30","120 Hz."]
[null,null,1,null,null,null,null,null,null,2]
[null,null,2,null,null,null,null,null,null,1]
[null,null,4,null,null,null,null,null,null,3]
[null,null,3,null,null,null,null,null,null,4]
[null,"Spolu :",null,null,null,null,null,null,"Spolu :"]
[]
[]
[]
[]
[]
[]
[null,null,null,"Plné","Chyby","Cel_30","120 Hz.",null,null,null,"Plné","Chyby","Cel_30","120 Hz."]
[null,null,3,null,null,null,null,null,null,4]
[null,null,4,null,null,null,null,null,null,3]
[null,null,2,null,null,null,null,null,null,1]
[null,null,1,null,null,null,null,null,null,2]
[null,"Spolu :",null,null,null,null,null,null,"Spolu :"]
[]
[]
[]
[]
[]
[]
[]
[null,{"$f":"$B$4","v":"Majstrovstvá kraja"},null,"Štvrtá štvorka hráčov 13 - 16",null,null,null,null,null,null,null,null,{"$f":"$M$4","v":"2019-04-10"}]
[]
[null,null,null,"Plné","Chyby","Cel_30","120 Hz.",null,null,null,"Plné","Chyby","Cel_30","120 Hz."]
[null,null,1,null,null,null,null,null,null,2]
[null,null,2,null,null,null,null,null,null,1]
[null,null,4,null,null,null,null,null,null,3]
[null,null,3,null,null,null,null,null,null,4]
[null,"Spolu :",null,null,null,null,null,null,"Spolu :"]
[]
[]
[]
[]
[]
[]
[null,null,null,"Plné","Chyby","Cel_30","120 Hz.",null,null,null,"Plné","Chyby","Cel_30","120 Hz."]
[null,null,3,null,null,null,null,null,null,4]
[null,null,4,null,null,null,null,null,null,3]
[null,null,2,null,null,null,null,null,null,1]
[null,null,1,null,null,null,null,null,null,2]
[null,"Spolu :",null,null,null,null,null,null,"Spolu :"]
[]
[]
[]
[]
[]
[]
[]
[null,{"$f":"$B$4","v":"Majstrovstvá kraja"},null,"Piata štvorka hráčov 17 - 20",null,null,null,null,null,null,null,null,{"$f":"$M$4","v":"2019-04-10"}]
[]
[null,null,null,"Plné","Chyby","Cel_30","120 Hz.",null,null,null,"Plné","Chyby","Cel_30","120 Hz."]
[null,null,1,null,null,null,null,null,null,2]
[null,null,2,null,null,null,null,null,null,1]
[null,null,4,null,null,null,null,null,null,3]
[null,null,3,null,null,null,null,null,null,4]
[null,"Spolu :",null,null,null,null,null,null,"Spolu :"]
[]
[]
[]
[]
[]
[]
[null,null,null,"Plné","Chyby","Cel_30","120 Hz.",null,null,null,"Plné","Chyby","Cel_30","120 Hz."]
[null,null,3,null,null,null,null,null,null,4]
[null,null,4,null,null,null,null,null,null,3]
[null,null,2,null,null,null,null,null,null,1]
[null,null,1,null,null,null,null,null,null,2]
[null,"Spolu :",null,null,null,null,null,null,"Spolu :"]
[]
[]
[]
[]
[]
[]
[]
[null,{"$f":"$B$4","v":"Majstrovstvá kraja"},null,"Šiesta štvorka hráčov 21 - 24",null,null,null,null,null,null,null,null,{"$f":"$M$4","v":"2019-04-10"}]
[]
[null,null,null,"Plné","Chyby","Cel_30","120 Hz.",null,null,null,"Plné","Chyby","Cel_30","120 Hz."]
[null,null,1,null,null,null,null,null,null,2]
[null,null,2,null,null,null,null,null,null,1]
[null,null,4,null,null,null,null,null,null,3]
[null,null,3,null,null,null,null,null,null,4]
[null,"Spolu :",null,null,null,null,null,null,"Spolu :"]
[]
[]
[]
[]
[]
[]
[null,null,null,"Plné","Chyby","Cel_30","120 Hz.",null,null,null,"Plné","Chyby","Cel_30","120 Hz."]
[null,null,3,null,null,null,null,null,null,4]
[null,null,4,null,null,null,null,null,null,3]
[null,null,2,null,null,null,null,null,null,1]
[null,null,1,null,null,null,null,null,null,2]
[null,"Spolu :",null,null,null,null,null,null,"Spolu :"]
[]
[]
[]
[]
[]
[]
[]
[null,{"$f":"$B$4","v":"Majstrovstvá kraja"},null,"Siedma štvorka hráčov 25 - 28",null,null,null,null,null,null,null,null,{"$f":"$M$4","v":"2019-04-10"}]
[]
[null,null,null,"Plné","Chyby","Cel_30","120 Hz.",null,null,null,"Plné","Chyby","Cel_30","120 Hz."]
[null,null,1,null,null,null,null,null,null,2]
[null,null,2,null,null,null,null,null,null,1]
[null,null,4,null,null,null,null,null,null,3]
[null,null,3,null,null,null,null,null,null,4]
[null,"Spolu :",null,null,null,null,null,null,"Spolu :"]
[]
[]
[]
[]
[]
[]
[null,null,null,"Plné","Chyby","Cel_30","120 Hz.",null,null,null,"Plné","Chyby","Cel_30","120 Hz."]
[null,null,3,null,null,null,null,null,null,4]
[null,null,4,null,null,null,null,null,null,3]
[null,null,2,null,null,null,null,null,null,1]
[null,null,1,null,null,null,null,null,null,2]
[null,"Spolu :",null,null,null,null,null,null,"Spolu :"]
[]
[]
[]
[]
[]
[]
[]
[null,{"$f":"$B$4","v":"Majstrovstvá kraja"},null,"Ôsma štvorka hráčov 29 - 32",null,null,null,null,null,null,null,null,{"$f":"$M$4","v":"2019-04-10"}]
[]
[null,null,null,"Plné","Chyby","Cel_30","120 Hz.",null,null,null,"Plné","Chyby","Cel_30","120 Hz."]
[null,null,1,null,null,null,null,null,null,2]
[null,null,2,null,null,null,null,null,null,1]
[null,null,4,null,null,null,null,null,null,3]
[null,null,3,null,null,null,null,null,null,4]
[null,"Spolu :",null,null,null,null,null,null,"Spolu :"]
[]
[]
[]
[]
[]
[]
[null,null,null,"Plné","Chyby","Cel_30","120 Hz.",null,null,null,"Plné","Chyby","Cel_30","120 Hz."]
[null,null,3,null,null,null,null,null,null,4]
[null,null,4,null,null,null,null,null,null,3]
[null,null,2,null,null,null,null,null,null,1]
[null,null,1,null,null,null,null,null,null,2]
[null,"Spolu :",null,null,null,null,null,null,"Spolu :"]
[]
[]
[]
[]
[]
[]
[]
[null,{"$f":"$B$4","v":"Majstrovstvá kraja"},null,"Deviata štvorka hráčov 33 - 36",null,null,null,null,null,null,null,null,{"$f":"$M$4","v":"2019-04-10"}]
[]
[null,null,null,"Plné","Chyby","Cel_30","120 Hz.",null,null,null,"Plné","Chyby","Cel_30","120 Hz."]
[null,null,1,null,null,null,null,null,null,2]
[null,null,2,null,null,null,null,null,null,1]
[null,null,4,null,null,null,null,null,null,3]
[null,null,3,null,null,null,null,null,null,4]
[null,"Spolu :",null,null,null,null,null,null,"Spolu :"]
[]
[]
[]
[]
[]
[]
[null,null,null,"Plné","Chyby","Cel_30","120 Hz.",null,null,null,"Plné","Chyby","Cel_30","120 Hz."]
[null,null,3,null,null,null,null,null,null,4]
[null,null,4,null,null,null,null,null,null,3]
[null,null,2,null,null,null,null,null,null,1]
[null,null,1,null,null,null,null,null,null,2]
[null,"Spolu :",null,null,null,null,null,null,"Spolu :"]

{"sheet":"ZapRozh_6d","index":1,"n_rows":154,"n_cols":16,"rows_kept":154,"cut":false,"hidden":false,"merged":[[3,15,4,16],[5,15,5,17],[3,1,5,1],[3,8,5,8],[6,15,6,17],[7,1,8,2],[7,3,8,3],[7,4,8,4],[7,5,8,5],[7,8,8,9],[0,3,0,8],[0,12,0,13],[7,12,8,12],[7,13,8,13],[26,12,26,13],[15,10,16,10],[15,11,16,11],[15,12,16,12],[7,10,8,10],[7,11,8,11],[23,10,24,10],[23,11,24,11],[23,12,24,12],[11,1,13,1],[11,8,13,8],[15,1,16,2],[15,3,16,3],[15,4,16,4],[15,5,16,5],[15,8,16,9],[26,3,26,8],[19,1,21,1],[19,8,21,8],[23,1,24,2],[23,3,24,3],[23,4,24,4],[23,5,24,5],[23,8,24,9],[29,1,31,1],[29,8,31,8],[33,1,34,2],[33,3,34,3],[33,4,34,4],[33,5,34,5],[33,8,34,9],[33,10,34,10],[33,11,34,11],[33,12,34,12],[33,13,34,13],[37,1,39,1],[37,8,39,8],[41,1,42,2],[41,3,42,3],[41,4,42,4],[41,5,42,5],[41,8,42,9],[41,10,42,10],[41,11,42,11],[41,12,42,12],[41,13,42,13],[49,11,50,11],[49,12,50,12],[49,13,50,13],[52,3,52,8],[52,12,52,13],[49,10,50,10],[45,1,47,1],[45,8,47,8],[55,1,57,1],[55,8,57,8],[49,1,50,2],[49,3,50,3],[49,4,50,4],[49,5,50,5],[49,8,50,9],[59,1,60,2],[59,3,60,3],[59,4,60,4],[59,5,60,5],[59,8,60,9],[67,13,68,13],[67,5,68,5],[71,1,73,1],[59,11,60,11],[59,12,60,12],[59,13,60,13],[63,1,65,1],[63,8,65,8],[67,1,68,2],[67,3,68,3],[59,10,60,10],[67,4,68,4],[71,8,73,8],[67,8,68,9],[85,10,86,10],[75,13,76,13],[78,3,78,8],[78,12,78,13],[75,10,76,10],[67,10,68,10],[67,11,68,11],[67,12,68,12],[75,12,76,12],[85,3,86,3],[85,4,86,4],[85,5,86,5],[93,11,94,11],[93,12,94,12],[93,13,94,13],[81,1,83,1],[81,8,83,8],[75,1,76,2],[75,3,76,3],[75,4,76,4],[75,5,76,5],[75,8,76,9],[93,1,94,2],[93,3,94,3],[93,4,94,4],[93,5,94,5],[93,8,94,9],[85,8,86,9],[75,11,76,11],[93,10,94,10],[85,11,86,11],[85,12,86,12],[85,13,86,13],[89,1,91,1],[89,8,91,8],[85,1,86,2],[101,11,102,11],[101,12,102,12],[101,13,102,13],[104,3,104,8],[104,12,104,13],[101,10,102,10],[97,1,99,1],[97,8,99,8],[107,1,109,1],[107,8,109,8],[101,1,102,2],[101,3,102,3],[101,4,102,4],[101,5,102,5],[101,8,102,9],[111,1,112,2],[111,3,112,3],[111,4,112,4],[111,5,112,5],[111,8,112,9],[119,13,120,13],[123,1,125,1],[123,8,125,8],[111,11,112,11],[111,12,112,12],[111,13,112,13],[115,1,117,1],[115,8,117,8],[119,1,120,2],[119,3,120,3],[111,10,112,10],[119,4,120,4],[119,5,120,5],[119,8,120,9],[119,10,120,10],[119,11,120,11],[119,12,120,12],[137,1,138,2],[137,3,138,3],[137,4,138,4],[137,5,138,5],[137,8,138,9],[127,10,128,10],[130,3,130,8],[133,1,135,1],[133,8,135,8],[127,1,128,2],[137,10,138,10],[137,11,138,11],[137,12,138,12],[137,13,138,13],[153,11,154,11],[127,3,128,3],[127,4,128,4],[127,5,128,5],[127,8,128,9],[145,5,146,5],[145,8,146,9],[153,12,154,12],[153,13,154,13],[145,10,146,10],[145,11,146,11],[145,12,146,12],[145,13,146,13],[153,10,154,10],[127,11,128,11],[127,12,128,12],[127,13,128,13],[130,12,130,13],[153,1,154,2],[153,3,154,3],[153,4,154,4],[153,5,154,5],[153,8,154,9],[141,1,143,1],[141,8,143,8],[145,1,146,2],[145,3,146,3],[145,4,146,4],[149,1,151,1],[149,8,151,8]]}
[null,"Majstrovstvá kraja",null,"Prvá šestka hráčov 1 - 6",null,null,null,null,null,null,null,null,{"$f":"TODAY()","v":"2019-04-10"}]
[]
[null,null,null,"Plné","Chyby","Cel_30","120 Hz.",null,null,null,"Plné","Chyby","Cel_30","120 Hz."]
[null,null,1,null,null,null,null,null,null,2,null,null,null,null,null,"  za 2."]
[null,null,2,null,null,null,null,null,null,1]
[null,null,4,null,null,null,null,null,null,3,null,null,null,null,null,"Pomocné zápisy"]
[null,null,3,null,null,null,null,null,null,4,null,null,null,null,null,"vytlačíš pre rozhodcu"]
[null,"Spolu :",null,null,null,null,null,null,"Spolu :"]
[]
[]
[null,null,null,"Plné","Chyby","Cel_30","120 Hz.",null,null,null,"Plné","Chyby","Cel_30","120 Hz."]
[null,null,3,null,null,null,null,null,null,4]
[null,null,4,null,null,null,null,null,null,3]
[null,null,6,null,null,null,null,null,null,5]
[null,null,5,null,null,null,null,null,null,6]
[null,"Spolu :",null,null,null,null,null,null,"Spolu :"]
[]
[]
[null,null,null,"Plné","Chyby","Cel_30","120 Hz.",null,null,null,"Plné","Chyby","Cel_30","120 Hz."]
[null,null,5,null,null,null,null,null,null,6]
[null,null,6,null,null,null,null,null,null,5]
[null,null,2,null,null,null,null,null,null,1]
[null,null,1,null,null,null,null,null,null,2]
[null,"Spolu :",null,null,null,null,null,null,"Spolu :"]
[]
[]
[null,{"$f":"$B$1","v":"Majstrovstvá kraja"},null,"Druhá šestka hráčov 7 - 12",null,null,null,null,null,null,null,null,{"$f":"$M$1","v":"2019-04-10"}]
[]
[null,null,null,"Plné","Chyby","Cel_30","120 Hz.",null,null,null,"Plné","Chyby","Cel_30","120 Hz."]
[null,null,1,null,null,null,null,null,null,2]
[null,null,2,null,null,null,null,null,null,1]
[null,null,4,null,null,null,null,null,null,3]
[null,null,3,null,null,null,null,null,null,4]
[null,"Spolu :",null,null,null,null,null,null,"Spolu :"]
[]
[]
[null,null,null,"Plné","Chyby","Cel_30","120 Hz.",null,null,null,"Plné","Chyby","Cel_30","120 Hz."]
[null,null,3,null,null,null,null,null,null,4]
[null,null,4,null,null,null,null,null,null,3]
[null,null,6,null,null,null,null,null,null,5]
[null,null,5,null,null,null,null,null,null,6]
[null,"Spolu :",null,null,null,null,null,null,"Spolu :"]
[]
[]
[null,null,null,"Plné","Chyby","Cel_30","120 Hz.",null,null,null,"Plné","Chyby","Cel_30","120 Hz."]
[null,null,5,null,null,null,null,null,null,6]
[null,null,6,null,null,null,null,null,null,5]
[null,null,2,null,null,null,null,null,null,1]
[null,null,1,null,null,null,null,null,null,2]
[null,"Spolu :",null,null,null,null,null,null,"Spolu :"]
[]
[]
[null,{"$f":"$B$1","v":"Majstrovstvá kraja"},null,"Tretia šestka hráčov 13 - 18",null,null,null,null,null,null,null,null,{"$f":"$M$1","v":"2019-04-10"}]
[]
[null,null,null,"Plné","Chyby","Cel_30","120 Hz.",null,null,null,"Plné","Chyby","Cel_30","120 Hz."]
[null,null,1,null,null,null,null,null,null,2]
[null,null,2,null,null,null,null,null,null,1]
[null,null,4,null,null,null,null,null,null,3]
[null,null,3,null,null,null,null,null,null,4]
[null,"Spolu :",null,null,null,null,null,null,"Spolu :"]
[]
[]
[null,null,null,"Plné","Chyby","Cel_30","120 Hz.",null,null,null,"Plné","Chyby","Cel_30","120 Hz."]
[null,null,3,null,null,null,null,null,null,4]
[null,null,4,null,null,null,null,null,null,3]
[null,null,6,null,null,null,null,null,null,5]
[null,null,5,null,null,null,null,null,null,6]
[null,"Spolu :",null,null,null,null,null,null,"Spolu :"]
[]
[]
[null,null,null,"Plné","Chyby","Cel_30","120 Hz.",null,null,null,"Plné","Chyby","Cel_30","120 Hz."]
[null,null,5,null,null,null,null,null,null,6]
[null,null,6,null,null,null,null,null,null,5]
[null,null,2,null,null,null,null,null,null,1]
[null,null,1,null,null,null,null,null,null,2]
[null,"Spolu :",null,null,null,null,null,null,"Spolu :"]
[]
[]
[null,{"$f":"$B$1","v":"Majstrovstvá kraja"},null,"Štvrtá šestka hráčov 19 - 24",null,null,null,null,null,null,null,null,{"$f":"$M$1","v":"2019-04-10"}]
[]
[null,null,null,"Plné","Chyby","Cel_30","120 Hz.",null,null,null,"Plné","Chyby","Cel_30","120 Hz."]
[null,null,1,null,null,null,null,null,null,2]
[null,null,2,null,null,null,null,null,null,1]
[null,null,4,null,null,null,null,null,null,3]
[null,null,3,null,null,null,null,null,null,4]
[null,"Spolu :",null,null,null,null,null,null,"Spolu :"]
[]
[]
[null,null,null,"Plné","Chyby","Cel_30","120 Hz.",null,null,null,"Plné","Chyby","Cel_30","120 Hz."]
[null,null,3,null,null,null,null,null,null,4]
[null,null,4,null,null,null,null,null,null,3]
[null,null,6,null,null,null,null,null,null,5]
[null,null,5,null,null,null,null,null,null,6]
[null,"Spolu :",null,null,null,null,null,null,"Spolu :"]
[]
[]
[null,null,null,"Plné","Chyby","Cel_30","120 Hz.",null,null,null,"Plné","Chyby","Cel_30","120 Hz."]
[null,null,5,null,null,null,null,null,null,6]
[null,null,6,null,null,null,null,null,null,5]
[null,null,2,null,null,null,null,null,null,1]
[null,null,1,null,null,null,null,null,null,2]
[null,"Spolu :",null,null,null,null,null,null,"Spolu :"]
[]
[]
[null,{"$f":"$B$1","v":"Majstrovstvá kraja"},null,"Piata šestka hráčov 25 - 30",null,null,null,null,null,null,null,null,{"$f":"$M$1","v":"2019-04-10"}]
[]
[null,null,null,"Plné","Chyby","Cel_30","120 Hz.",null,null,null,"Plné","Chyby","Cel_30","120 Hz."]
[null,null,1,null,null,null,null,null,null,2]
[null,null,2,null,null,null,null,null,null,1]
[null,null,4,null,null,null,null,null,null,3]
[null,null,3,null,null,null,null,null,null,4]
[null,"Spolu :",null,null,null,null,null,null,"Spolu :"]
[]
[]
[null,null,null,"Plné","Chyby","Cel_30","120 Hz.",null,null,null,"Plné","Chyby","Cel_30","120 Hz."]
[null,null,3,null,null,null,null,null,null,4]
[null,null,4,null,null,null,null,null,null,3]
[null,null,6,null,null,null,null,null,null,5]
[null,null,5,null,null,null,null,null,null,6]
[null,"Spolu :",null,null,null,null,null,null,"Spolu :"]
[]
[]
[null,null,null,"Plné","Chyby","Cel_30","120 Hz.",null,null,null,"Plné","Chyby","Cel_30","120 Hz."]
[null,null,5,null,null,null,null,null,null,6]
[null,null,6,null,null,null,null,null,null,5]
[null,null,2,null,null,null,null,null,null,1]
[null,null,1,null,null,null,null,null,null,2]
[null,"Spolu :",null,null,null,null,null,null,"Spolu :"]
[]
[]
[null,{"$f":"$B$1","v":"Majstrovstvá kraja"},null,"Šiesta šestka hráčov 31 - 36",null,null,null,null,null,null,null,null,{"$f":"$M$1","v":"2019-04-10"}]
[]
[null,null,null,"Plné","Chyby","Cel_30","120 Hz.",null,null,null,"Plné","Chyby","Cel_30","120 Hz."]
[null,null,1,null,null,null,null,null,null,2]
[null,null,2,null,null,null,null,null,null,1]
[null,null,4,null,null,null,null,null,null,3]
[null,null,3,null,null,null,null,null,null,4]
[null,"Spolu :",null,null,null,null,null,null,"Spolu :"]
[]
[]
[null,null,null,"Plné","Chyby","Cel_30","120 Hz.",null,null,null,"Plné","Chyby","Cel_30","120 Hz."]
[null,null,3,null,null,null,null,null,null,4]
[null,null,4,null,null,null,null,null,null,3]
[null,null,6,null,null,null,null,null,null,5]
[null,null,5,null,null,null,null,null,null,6]
[null,"Spolu :",null,null,null,null,null,null,"Spolu :"]
[]
[]
[null,null,null,"Plné","Chyby","Cel_30","120 Hz.",null,null,null,"Plné","Chyby","Cel_30","120 Hz."]
[null,null,5,null,null,null,null,null,null,6]
[null,null,6,null,null,null,null,null,null,5]
[null,null,2,null,null,null,null,null,null,1]
[null,null,1,null,null,null,null,null,null,2]
[null,"Spolu :",null,null,null,null,null,null,"Spolu :"]

{"sheet":"MužiZáp","index":2,"n_rows":75,"n_cols":13,"rows_kept":75,"cut":false,"hidden":false,"merged":[[0,1,0,2],[11,12,11,14],[1,1,1,2],[1,7,1,9],[0,5,0,9],[1,4,1,6],[0,12,0,14],[1,12,1,14],[12,12,12,14],[8,12,8,15],[7,12,7,15],[3,12,4,13],[5,12,5,15],[6,12,6,15],[10,12,10,14]]}
[null,"Majstrovstvá kraja",null,"Muži","Kraj :","Trenčiansky",null,null,null,null,null,null,"Napísať Kraj"]
[null,2019,null,"kolkáreň :","Stará Turá",null,null,"31.3.2019",null,null,null,null,"Kolkáreň a Dátum"]
[null,"Š.č.","Hráč","Č.r.p.","Klub","Plné","Dor.","Ch.","Celkom","Porad."]
[null,1,"Truska Jaroslav",8057,"TKK Trenčín",408,{"$f":"I4-F4","v":251},0,659,{"$f":"IF(I4=0,\"\",RANK(I4,$I$4:$I$75))","v":2},{"$f":"IF(I4=\"\",\"nie\",\"áno\")","v":"áno"},null,"  za 1."]
[null,2,"Truska Tomáš",7968,"TKK Trenčín",352,168,8,520,{"$f":"IF(I5=0,\"\",RANK(I5,$I$4:$I$75))","v":29},{"$f":"IF(I5=\"\",\"nie\",\"áno\")","v":"áno"}]
[null,3,"Varga Eduard",7969,"TKK Trenčín",366,184,3,550,18,"áno",null,"Tu píšeš mená, čisla reg.prukazov"]
[null,4,"Bielko Dušan",8034,"DKK Nové Mesto nad Váhom",381,193,4,574,14,"áno",null,"klub, plné, chyby a celkom."]
[null,5,"Moško Rastislav",8046,"Dubnica",365,169,13,534,24,"áno",null,"Priebežne dáš vytlačiť."]
[null,6,"Hajaš Martin",7789,"Dubnica",358,204,4,562,15,"áno",null,"Dorážku a poradie NEVYPISOVAŤ !!!"]
[null,7,"Švaro Jaroslav",7756,"DKK Nové Mesto nad Váhom",374,168,6,542,20,"áno"]
[null,8,"Vojtek Peter",564,"DKK Nové Mesto nad Váhom",358,174,3,532,25,"áno",null,"Vzor písania hráča"]
[null,9,"Mikulec Marek",7940,"DKK Nové Mesto nad Váhom",384,210,1,594,4,"áno",null,"1- Priezvisko, 2- Meno"]
[null,10,"Sadloň Kamil",7878,"MKK Stará Turá",380,212,3,592,5,"áno",null,"Perecár Miroslav"]
[null,11,"Hvožďara Peter",112,"MKK Stará Turá",378,205,2,583,9,"áno"]
[null,12,"Nemček Peter",297,"MKK Stará Turá",375,208,2,583,9,"áno"]
[null,13,"Minarech Roman",7879,"MKK Stará Turá",384,198,4,582,11,"áno"]
[null,14,"Benko Michal",226,"KK Pobedím",394,192,3,586,7,"áno"]
[null,15,"Žitňanský Ivan",20,"KK Pobedím",386,153,4,539,22,"áno"]
[null,16,"Mrekaj Marek",227,"KK Pobedím",370,212,6,582,11,"áno"]
[null,17,"Miklovič Jozef",8010,"KK Pobedím",405,257,1,662,1,"áno"]
[null,18,"Černý Pavol",2663,"KK Pobedím",354,168,5,522,27,"áno"]
[null,19,"Kellner Peter",2130,"TKK Trenčín",369,152,7,521,28,"áno"]
[null,20,"Bednár Ľubomír",1446,"MKK Stará Turá",366,181,3,547,19,"áno"]
[null,21,"Kičinko Jakub",64,"TKK Trenčín",360,200,4,560,16,"áno"]
[null,22,"Huba Marián",2152,"TKK Trenčín",386,198,6,584,8,"áno"]
[null,23,"Sirotný Pavel",754,"KK Hustra Uhrovec",368,187,6,555,17,"áno"]
[null,24,"Dubravický Ján",2658,"KK Hustra Uhrovec",351,157,10,508,31,"áno"]
[null,25,"Mišina Juraj",544,"KK Hustra Uhrovec",366,152,9,518,30,"áno"]
[null,26,"Dzúrik Martin",7958,"TKK Trenčín",402,176,3,578,13,"áno"]
[null,27,"Jorík Pavol",2,"TKK Trenčín",361,180,6,541,21,"áno"]
[null,28,"Truska Milan",7967,"TKK Trenčín",376,236,2,612,3,"áno"]
[null,29,"Papšo Michal",549,"BKK Bánovce n/B",358,141,8,499,32,"áno"]
[null,30,"Bročko Pavel",1423,"BKK Bánovce n/B",383,209,2,592,5,"áno"]
[null,31,"Pecháček Roman",8045,"MKK Stará Turá",364,174,10,538,23,"áno"]
[null,32,"Bača Miroslav",8134,"KK Moravké Lieskové",371,158,8,529,26,"áno"]
[null,33,null,null,null,null,0,null,null,"","nie"]
[null,34,null,null,null,null,0,null,null,"","nie"]
[null,35,null,null,null,null,0,null,null,"","nie"]
[null,36,null,null,null,null,0,null,null,"","nie"]
[null,37,null,null,null,null,0,null,null,"","nie"]
[null,38,null,null,null,null,0,null,null,"","nie"]
[null,39,null,null,null,null,0,null,null,"","nie"]
[null,40,null,null,null,null,0,null,null,"","nie"]
[null,41,null,null,null,null,0,null,null,"","nie"]
[null,42,null,null,null,null,0,null,null,"","nie"]
[null,43,null,null,null,null,0,null,null,"","nie"]
[null,44,null,null,null,null,0,null,null,"","nie"]
[null,45,null,null,null,null,0,null,null,"","nie"]
[null,46,null,null,null,null,0,null,null,"","nie"]
[null,47,null,null,null,null,0,null,null,"","nie"]
[null,48,null,null,null,null,0,null,null,"","nie"]
[null,49,null,null,null,null,0,null,null,"","nie"]
[null,50,null,null,null,null,0,null,null,"","nie"]
[null,51,null,null,null,null,0,null,null,"","nie"]
[null,52,null,null,null,null,0,null,null,"","nie"]
[null,53,null,null,null,null,0,null,null,"","nie"]
[null,54,null,null,null,null,0,null,null,"","nie"]
[null,55,null,null,null,null,0,null,null,"","nie"]
[null,56,null,null,null,null,0,null,null,"","nie"]
[null,57,null,null,null,null,0,null,null,"","nie"]
[null,58,null,null,null,null,0,null,null,"","nie"]
[null,59,null,null,null,null,0,null,null,"","nie"]
[null,60,null,null,null,null,0,null,null,"","nie"]
[null,61,null,null,null,null,0,null,null,"","nie"]
[null,62,null,null,null,null,0,null,null,"","nie"]
[null,63,null,null,null,null,0,null,null,"","nie"]
[null,64,null,null,null,null,0,null,null,"","nie"]
[null,65,null,null,null,null,{"$f":"I68-F68","v":0},null,null,"","nie"]
[null,66,null,null,null,null,0,null,null,{"$f":"IF(I69=0,\"\",RANK(I69,$I$4:$I$75))","v":""},{"$f":"IF(I69=\"\",\"nie\",\"áno\")","v":"nie"}]
[null,67,null,null,null,null,0,null,null,"","nie"]
[null,68,null,null,null,null,0,null,null,"","nie"]
[null,69,null,null,null,null,0,null,null,"","nie"]
[null,70,null,null,null,null,0,null,null,"","nie"]
[null,71,null,null,null,null,0,null,null,"","nie"]
[null,72,null,null,null,null,0,null,null,"","nie"]

{"sheet":"ŽenyZáp","index":3,"n_rows":33,"n_cols":13,"rows_kept":33,"cut":false,"hidden":false,"merged":[[3,12,4,13],[5,12,5,15],[0,1,0,2],[1,1,1,2],[0,5,0,9],[1,7,1,9],[0,12,0,14],[1,4,1,6],[1,12,1,14],[10,12,10,14],[11,12,11,14],[12,12,12,14],[8,12,8,15],[6,12,6,15],[7,12,7,15]]}
[null,"Majstrovstvá kraja",null,"Ženy","Kraj :","Trenčiansky",null,null,null,null,null,null,"Napísať Kraj"]
[null,2019,null,"kolkáreň :","Trenčín",null,null,"31.3.2019",null,null,null,null,"Kolkáreň a Dátum"]
[null,"Š.č.","Hráčka","Č.r.p.","Klub","Plné","Dor.","Ch.","Celkom","Porad."]
[null,1,"Búliková Erika",7955,"TKK Trenčín",345,{"$f":"I4-F4","v":154},11,499,{"$f":"IF(I4=0,\"\",RANK(I4,$I$4:$I$33))","v":2},{"$f":"IF(I4=\"\",\"nie\",\"áno\")","v":"áno"},null,"  za 1."]
[null,2,"Gordíková Lenka",919,"MKK Stará Turá",352,{"$f":"I5-F5","v":201},2,553,1,{"$f":"IF(I5=\"\",\"nie\",\"áno\")","v":"áno"}]
[null,3,"Radošová Eva",963,"KK Moravské Lieskové",328,137,15,465,3,"áno",null,"Tu píšeš mená, čisla reg.prukazov"]
[null,4,null,null,null,null,0,null,null,"","nie",null,"klub, plné, chyby a celkom."]
[null,5,null,null,null,null,0,null,null,"","nie",null,"Priebežne dáš vytlačiť."]
[null,6,null,null,null,null,0,null,null,"","nie",null,"Dorážku a poradie NEVYPISOVAŤ !!!"]
[null,7,null,null,null,null,0,null,null,"","nie"]
[null,8,null,null,null,null,0,null,null,"","nie",null,"Vzor písania hráčky"]
[null,9,null,null,null,null,0,null,null,"","nie",null,"1- Priezvisko, 2- Meno"]
[null,10,null,null,null,null,0,null,null,"","nie",null,"Perecárová  Miroslava"]
[null,11,null,null,null,null,0,null,null,"","nie"]
[null,12,null,null,null,null,0,null,null,"","nie"]
[null,13,null,null,null,null,0,null,null,"","nie"]
[null,14,null,null,null,null,0,null,null,"","nie"]
[null,15,null,null,null,null,0,null,null,"","nie"]
[null,16,null,null,null,null,0,null,null,"","nie"]
[null,17,null,null,null,null,0,null,null,"","nie"]
[null,18,null,null,null,null,0,null,null,"","nie"]
[null,19,null,null,null,null,0,null,null,"","nie"]
[null,20,null,null,null,null,0,null,null,"","nie"]
[null,21,null,null,null,null,0,null,null,"","nie"]
[null,22,null,null,null,null,0,null,null,"","nie"]
[null,23,null,null,null,null,0,null,null,"","nie"]
[null,24,null,null,null,null,0,null,null,"","nie"]
[null,25,null,null,null,null,0,null,null,"","nie"]
[null,26,null,null,null,null,0,null,null,"","nie"]
[null,27,null,null,null,null,0,null,null,"","nie"]
[null,28,null,null,null,null,0,null,null,"","nie"]
[null,29,null,null,null,null,0,null,null,"","nie"]
[null,30,null,null,null,null,0,null,null,"","nie"]

{"sheet":"SenioriU_50Záp","index":4,"n_rows":51,"n_cols":13,"rows_kept":51,"cut":false,"hidden":false,"merged":[[12,12,12,14],[0,1,0,2],[3,12,4,13],[1,1,1,2],[0,5,0,9],[1,7,1,9],[5,12,5,15],[6,12,6,15],[7,12,7,15],[8,12,8,15],[10,12,10,14],[0,12,0,14],[1,4,1,6],[1,12,1,14],[11,12,11,14]]}
[null,"MK - Seniori",null,"U - 50","Kraj :","Trenčiansky",null,null,null,null,null,null,"Napísať Kraj"]
[null,2019,null,"kolkáreň :","Trenčín",null,null,"3.2.2019",null,null,null,null,"Kolkáreň a Dátum"]
[null,"Š.č.","Hráč","Č.r.p.","Klub","Plné","Dor.","Ch.","Celkom","Porad."]
[null,1,"Bača Ján",1088,"KK Moravské Lieskové",352,{"$f":"I4-F4","v":156},9,508,{"$f":"IF(I4=0,\"\",RANK(I4,$I$4:$I$51))","v":15},{"$f":"IF(I4=\"\",\"nie\",\"áno\")","v":"áno"},null,"  za 1."]
[null,2,"Malíček Dušan",8137,"KK Moravské Lieskové",367,142,12,509,14,{"$f":"IF(I5=\"\",\"nie\",\"áno\")","v":"áno"}]
[null,3,"Adamkovič Marian",null,"KK Uhrovec",324,139,14,463,22,"áno",null,"Tu píšeš mená, čisla reg.prukazov"]
[null,4,"Búlik Jozef",7954,"TKK Trenčín",359,160,5,519,12,"áno",null,"klub, plné, chyby a celkom."]
[null,5,"Minárik Anton",8049,"KK Dubnica",353,152,11,505,16,"áno",null,"Priebežne dáš vytlačiť."]
[null,6,"Moško Ivan",7981,"KK Dubnica",348,141,13,489,17,"áno",null,"Dorážku a poradie NEVYPISOVAŤ !!!"]
[null,7,"Strempek Milan",860,"KK Uhrovec",311,148,11,459,23,"áno"]
[null,8,"Vavrinec Jozef",7764,"TKK Trenčín",361,187,5,548,3,"áno",null,"Vzor písania hráča"]
[null,9,"Truska Milan",7967,"TKK Trenčín",369,164,5,533,7,"áno",null,"1- Priezvisko, 2- Meno"]
[null,10,"Okša Milan",587,"KK Uhrovec",284,84,24,368,25,"áno",null,"Perecár Miroslav"]
[null,11,"Petreje Pavol",374,"KK Uhrovec",349,175,8,524,9,"áno"]
[null,12,"Nedbal Jaroslav",2629,"DKK Nové Mesto n. Váhom",344,141,12,485,19,"áno"]
[null,13,"Moravčík Roman",8038,"DKK Nové Mesto n. Váhom",349,164,7,513,13,"áno"]
[null,14,"Luščík Libor",2638,"DKK Nové Mesto n. Váhom",337,146,17,483,20,"áno"]
[null,15,"Hochel Ján",7876,"MKK Stará Turá",375,181,7,556,2,"áno"]
[null,16,"Stejskal Igor",7882,"MKK Stará Turá",351,173,3,524,9,"áno"]
[null,17,"Štefka Ľubomír",506,"MKK Stará Turá",356,185,5,541,5,"áno"]
[null,18,"Nemček Peter",297,"MKK Stará Turá",349,194,1,543,4,"áno"]
[null,19,"Pavlík Peter",7964,"TKK Trenčín",360,176,3,536,6,"áno"]
[null,20,"Cích Branislav",7957,"TKK Trenčín",368,156,6,524,9,"áno"]
[null,21,"Podolák Jaroslav",7986,"BKK Bánovce nad Bebravou",377,201,2,578,1,"áno"]
[null,22,"Adamkovič Dalibor",884,"BKK Bánovce nad Bebravou",321,99,20,420,24,"áno"]
[null,23,"Moravčík Jozef",8220,"MKK Stará Turá",345,132,14,477,21,"áno"]
[null,24,"Miškovič Marian",7883,"MKK Stará Turá",374,157,7,531,8,"áno"]
[null,25,"Fodora Peter",885,"BKK Bánovce nad Bebravou",340,148,13,488,18,"áno"]
[null,26,null,null,null,null,0,null,null,"","nie"]
[null,27,null,null,null,null,0,null,null,"","nie"]
[null,28,null,null,null,null,0,null,null,"","nie"]
[null,29,null,null,null,null,0,null,null,"","nie"]
[null,30,null,null,null,null,0,null,null,"","nie"]
[null,31,null,null,null,null,0,null,null,"","nie"]
[null,32,null,null,null,null,0,null,null,"","nie"]
[null,33,null,null,null,null,0,null,null,"","nie"]
[null,34,null,null,null,null,0,null,null,"","nie"]
[null,35,null,null,null,null,0,null,null,"","nie"]
[null,36,null,null,null,null,0,null,null,"","nie"]
[null,37,null,null,null,null,0,null,null,"","nie"]
[null,38,null,null,null,null,0,null,null,"","nie"]
[null,39,null,null,null,null,0,null,null,"","nie"]
[null,40,null,null,null,null,0,null,null,"","nie"]
[null,41,null,null,null,null,0,null,null,"","nie"]
[null,42,null,null,null,null,0,null,null,"","nie"]
[null,43,null,null,null,null,0,null,null,"","nie"]
[null,44,null,null,null,null,0,null,null,"","nie"]
[null,45,null,null,null,null,0,null,null,"","nie"]
[null,46,null,null,null,null,0,null,null,"","nie"]
[null,47,null,null,null,null,0,null,null,"","nie"]
[null,48,null,null,null,null,0,null,null,"","nie"]

{"sheet":"SeniorkyU_50Záp","index":5,"n_rows":33,"n_cols":13,"rows_kept":33,"cut":false,"hidden":false,"merged":[[12,12,12,14],[0,1,0,2],[3,12,4,13],[1,1,1,2],[0,5,0,9],[1,7,1,9],[5,12,5,15],[6,12,6,15],[7,12,7,15],[8,12,8,15],[10,12,10,14],[0,12,0,14],[1,4,1,6],[1,12,1,14],[11,12,11,14]]}
[null,"MK - Seniorky",null,"U - 50","Kraj :","Trenčiansky",null,null,null,null,null,null,"Napísať Kraj"]
[null,2019,null,"kolkáreň :","Trenčín",null,null,"31.3.2019",null,null,null,null,"Kolkáreň a Dátum"]
[null,"Š.č.","Hráčka","Č.r.p.","Klub","Plné","Dor.","Ch.","Celkom","Porad."]
[null,1,"Bošnáková Janka",7953,"TKK Trenčín",385,{"$f":"I4-F4","v":185},5,570,{"$f":"IF(I4=0,\"\",RANK(I4,$I$4:$I$33))","v":1},{"$f":"IF(I4=\"\",\"nie\",\"áno\")","v":"áno"},null,"  za 1."]
[null,2,"Kičinková Eva",1043,"TKK Trenčín",371,{"$f":"I5-F5","v":141},11,512,{"$f":"IF(I5=0,\"\",RANK(I5,$I$4:$I$33))","v":2},{"$f":"IF(I5=\"\",\"nie\",\"áno\")","v":"áno"}]
[null,3,"Furstenová Elena",2146,"TKK Trenčín",null,{"$error":"#VALUE!"},null,"Skreč",{"$f":"IF(I6=0,\"\",RANK(I6,$I$4:$I$33))","v":{"$error":"#VALUE!"}},"áno",null,"Tu píšeš mená, čisla reg.prukazov"]
[null,4,null,null,null,null,0,null,null,"","nie",null,"klub, plné, chyby a celkom."]
[null,5,null,null,null,null,0,null,null,"","nie",null,"Priebežne dáš vytlačiť."]
[null,6,null,null,null,null,0,null,null,"","nie",null,"Dorážku a poradie NEVYPISOVAŤ !!!"]
[null,7,null,null,null,null,0,null,null,"","nie"]
[null,8,null,null,null,null,0,null,null,"","nie",null,"Vzor písania hráčky"]
[null,9,null,null,null,null,0,null,null,"","nie",null,"1- Priezvisko, 2- Meno"]
[null,10,null,null,null,null,0,null,null,"","nie",null,"Perecárová  Miroslava"]
[null,11,null,null,null,null,0,null,null,"","nie"]
[null,12,null,null,null,null,0,null,null,"","nie"]
[null,13,null,null,null,null,0,null,null,"","nie"]
[null,14,null,null,null,null,0,null,null,"","nie"]
[null,15,null,null,null,null,0,null,null,"","nie"]
[null,16,null,null,null,null,0,null,null,"","nie"]
[null,17,null,null,null,null,0,null,null,"","nie"]
[null,18,null,null,null,null,0,null,null,"","nie"]
[null,19,null,null,null,null,0,null,null,"","nie"]
[null,20,null,null,null,null,0,null,null,"","nie"]
[null,21,null,null,null,null,0,null,null,"","nie"]
[null,22,null,null,null,null,0,null,null,"","nie"]
[null,23,null,null,null,null,0,null,null,"","nie"]
[null,24,null,null,null,null,0,null,null,"","nie"]
[null,25,null,null,null,null,0,null,null,"","nie"]
[null,26,null,null,null,null,0,null,null,"","nie"]
[null,27,null,null,null,null,0,null,null,"","nie"]
[null,28,null,null,null,null,0,null,null,"","nie"]
[null,29,null,null,null,null,0,null,null,"","nie"]
[null,30,null,null,null,null,0,null,null,"","nie"]

{"sheet":"SenioriU_60Záp","index":6,"n_rows":51,"n_cols":13,"rows_kept":51,"cut":false,"hidden":false,"merged":[[11,12,11,14],[12,12,12,14],[3,12,4,13],[5,12,5,15],[6,12,6,15],[7,12,7,15],[8,12,8,15],[10,12,10,14],[0,1,0,2],[0,5,0,9],[1,1,1,2],[1,7,1,9],[0,12,0,14],[1,4,1,6],[1,12,1,14]]}
[null,"MK - Seniori",null,"U - 60","Kraj :","Trenčiansky",null,null,null,null,null,null,"Napísať Kraj"]
[null,2019,null,"kolkáreň :","Stará Turá",null,null,"27.1.2019",null,null,null,null,"Kolkáreň a Dátum"]
[null,"Š.č.","Hráč","Č.r.p.","Klub","Plné","Dor.","Ch.","Celkom","Porad."]
[null,1,"Ďuďák Pavol",1399,"TKK Trenčín",370,{"$f":"I4-F4","v":176},4,546,{"$f":"IF(I4=0,\"\",RANK(I4,$I$4:$I$51))","v":5},{"$f":"IF(I4=\"\",\"nie\",\"áno\")","v":"áno"},null,"  za 1."]
[null,2,"Tomat Peter",7966,"TKK Trenčín",358,119,19,477,19,{"$f":"IF(I5=\"\",\"nie\",\"áno\")","v":"áno"}]
[null,3,"Maschke Vladimír",7962,"TKK Trenčín",321,138,18,459,21,"áno",null,"Tu píšeš mená, čisla reg.prukazov"]
[null,4,"Kebísek Ján",7982,"KK Dubnica",343,127,12,470,20,"áno",null,"klub, plné, chyby a celkom."]
[null,5,"Vagovič Pavol",7794,"KK Dubnica",367,150,11,517,11,"áno",null,"Priebežne dáš vytlačiť."]
[null,6,"Bača Jozef",338,"DKK Nové Mesto n/V",356,152,9,508,13,"áno",null,"Dorážku a poradie NEVYPISOVAŤ !!!"]
[null,7,"Galis Dušan",8003,"KK Hustra Uhrovec",341,149,12,490,16,"áno"]
[null,8,"Danaj Vladimír",8002,"KK Hustra Uhrovec",365,157,16,522,10,"áno",null,"Vzor písania hráča"]
[null,9,"Sitár Pavol",8006,"KK Hustra Uhrovec",378,182,4,560,3,"áno",null,"1- Priezvisko, 2- Meno"]
[null,10,"Lukáč Svätoslav",8116,"MKK Stará Turá",350,97,24,447,23,"áno",null,"Perecár Miroslav"]
[null,11,"Šupík Michal",1006,"MKK Stará Turá",389,158,7,547,4,"áno"]
[null,12,"Maroň Ján",7880,"MKK Stará Turá",393,202,2,595,1,"áno"]
[null,13,"Solovič Ján",8114,"MKK Stará Turá",333,124,18,457,22,"áno"]
[null,14,"Peško Juraj",7765,"MKK Stará Turá",377,129,18,506,14,"áno"]
[null,15,"Guštara Štefan",7961,"TKK Trenčín",357,179,6,536,7,"áno"]
[null,16,"Vlčák Juraj",7970,"TKK Trenčín",341,185,8,526,9,"áno"]
[null,17,"Porubský Miroslav",7965,"TKK Trenčín",365,181,7,546,5,"áno"]
[null,18,"Vojtáš Karol",7971,"TKK Trenčín",388,175,8,563,2,"áno"]
[null,19,"Breuer Karol",8148,"TKK Trenčín",328,154,12,482,17,"áno"]
[null,20,"Bročko Július",7987,"BKK Bánovce nad Bebravou",364,165,8,529,8,"áno"]
[null,21,"Šujan Anton",1438,"BKK Bánovce nad Bebravou",356,122,17,478,18,"áno"]
[null,22,"Pristač Anton",552,"BKK Bánovce nad Bebravou",344,156,10,500,15,"áno"]
[null,23,"Žitnaň Ivan",7988,"BKK Bánovce nad Bebravou",367,145,9,512,12,"áno"]
[null,24,"Tóth Viktor",1219,"BKK Bánovce nad Bebravou",296,64,31,360,24,"áno"]
[null,25,null,null,null,null,0,null,null,"","nie"]
[null,26,null,null,null,null,0,null,null,"","nie"]
[null,27,null,null,null,null,0,null,null,"","nie"]
[null,28,null,null,null,null,0,null,null,"","nie"]
[null,29,null,null,null,null,0,null,null,"","nie"]
[null,30,null,null,null,null,0,null,null,"","nie"]
[null,31,null,null,null,null,0,null,null,"","nie"]
[null,32,null,null,null,null,0,null,null,"","nie"]
[null,33,null,null,null,null,0,null,null,"","nie"]
[null,34,null,null,null,null,0,null,null,"","nie"]
[null,35,null,null,null,null,0,null,null,"","nie"]
[null,36,null,null,null,null,0,null,null,"","nie"]
[null,37,null,null,null,null,0,null,null,"","nie"]
[null,38,null,null,null,null,0,null,null,"","nie"]
[null,39,null,null,null,null,0,null,null,"","nie"]
[null,40,null,null,null,null,0,null,null,"","nie"]
[null,41,null,null,null,null,0,null,null,"","nie"]
[null,42,null,null,null,null,0,null,null,"","nie"]
[null,43,null,null,null,null,0,null,null,"","nie"]
[null,44,null,null,null,null,0,null,null,"","nie"]
[null,45,null,null,null,null,0,null,null,"","nie"]
[null,46,null,null,null,null,0,null,null,"","nie"]
[null,47,null,null,null,null,0,null,null,"","nie"]
[null,48,null,null,null,null,0,null,null,"","nie"]

{"sheet":"SeniorkyU_60Záp","index":7,"n_rows":33,"n_cols":13,"rows_kept":33,"cut":false,"hidden":false,"merged":[[12,12,12,14],[0,12,0,14],[1,4,1,6],[1,12,1,14],[3,12,4,13],[5,12,5,15],[6,12,6,15],[7,12,7,15],[8,12,8,15],[10,12,10,14],[0,1,0,2],[0,5,0,9],[1,1,1,2],[1,7,1,9],[11,12,11,14]]}
[null,"MK - Seniorky",null,"U - 60","Kraj :","Trenčiansky",null,null,null,null,null,null,"Napísať Kraj"]
[null,2019,null,"kolkáreň :","Trenčín",null,null,"31.3.2019",null,null,null,null,"Kolkáreň a Dátum"]
[null,"Š.č.","Hráčka","Č.r.p.","Klub","Plné","Dor.","Ch.","Celkom","Porad."]
[null,1,"Nemčeková Anna",1002,"MKK Stará Turá",370,{"$f":"I4-F4","v":134},13,504,{"$f":"IF(I4=0,\"\",RANK(I4,$I$4:$I$33))","v":1},{"$f":"IF(I4=\"\",\"nie\",\"áno\")","v":"áno"},null,"  za 1."]
[null,2,"Garafová Magda",7875,"MKK Stará Turá",347,{"$f":"I5-F5","v":146},12,493,{"$f":"IF(I5=0,\"\",RANK(I5,$I$4:$I$33))","v":2},{"$f":"IF(I5=\"\",\"nie\",\"áno\")","v":"áno"}]
[null,3,null,null,null,null,0,null,null,{"$f":"IF(I6=0,\"\",RANK(I6,$I$4:$I$33))","v":""},"nie",null,"Tu píšeš mená, čisla reg.prukazov"]
[null,4,null,null,null,null,0,null,null,"","nie",null,"klub, plné, chyby a celkom."]
[null,5,null,null,null,null,0,null,null,"","nie",null,"Priebežne dáš vytlačiť."]
[null,6,null,null,null,null,0,null,null,"","nie",null,"Dorážku a poradie NEVYPISOVAŤ !!!"]
[null,7,null,null,null,null,0,null,null,"","nie"]
[null,8,null,null,null,null,0,null,null,"","nie",null,"Vzor písania hráčky"]
[null,9,null,null,null,null,0,null,null,"","nie",null,"1- Priezvisko, 2- Meno"]
[null,10,null,null,null,null,0,null,null,"","nie",null,"Perecárová  Miroslava"]
[null,11,null,null,null,null,0,null,null,"","nie"]
[null,12,null,null,null,null,0,null,null,"","nie"]
[null,13,null,null,null,null,0,null,null,"","nie"]
[null,14,null,null,null,null,0,null,null,"","nie"]
[null,15,null,null,null,null,0,null,null,"","nie"]
[null,16,null,null,null,null,0,null,null,"","nie"]
[null,17,null,null,null,null,0,null,null,"","nie"]
[null,18,null,null,null,null,0,null,null,"","nie"]
[null,19,null,null,null,null,0,null,null,"","nie"]
[null,20,null,null,null,null,0,null,null,"","nie"]
[null,21,null,null,null,null,0,null,null,"","nie"]
[null,22,null,null,null,null,0,null,null,"","nie"]
[null,23,null,null,null,null,0,null,null,"","nie"]
[null,24,null,null,null,null,0,null,null,"","nie"]
[null,25,null,null,null,null,0,null,null,"","nie"]
[null,26,null,null,null,null,0,null,null,"","nie"]
[null,27,null,null,null,null,0,null,null,"","nie"]
[null,28,null,null,null,null,0,null,null,"","nie"]
[null,29,null,null,null,null,0,null,null,"","nie"]
[null,30,null,null,null,null,0,null,null,"","nie"]

{"sheet":"JunioriZáp","index":8,"n_rows":43,"n_cols":13,"rows_kept":43,"cut":false,"hidden":false,"merged":[[0,1,0,2],[3,12,4,13],[5,12,5,15],[6,12,6,15],[7,12,7,15],[0,5,0,9],[1,7,1,9],[0,12,0,14],[12,12,12,14],[10,12,10,14],[11,12,11,14],[8,12,8,15],[1,1,1,2],[1,4,1,6],[1,12,1,14]]}
[null,"MK - Juniori",null,"U - 23","Kraj :","Trenčiansky",null,null,null,null,null,null,"Napísať Kraj"]
[null,2019,null,"kolkáreň :","Stará Turá",null,null,"20.1.2019",null,null,null,null,"Kolkáreň a Dátum"]
[null,"Š.č.","Hráč","Č.r.p.","Klub","Plné","Dor.","Ch.","Celkom","Porad."]
[null,1,"Dzúrik Martin",7958,"TKK Trenčín",384,{"$f":"I4-F4","v":218},3,602,{"$f":"IF(I4=0,\"\",RANK(I4,$I$4:$I$43))","v":1},{"$f":"IF(I4=\"\",\"nie\",\"áno\")","v":"áno"},null,"  za 1."]
[null,2,"Truska Tomáš",7968,"TKK Trenčín",359,211,5,570,4,{"$f":"IF(I5=\"\",\"nie\",\"áno\")","v":"áno"}]
[null,3,"Černý Michal",954,"KK Moravské Lieskové",397,140,14,537,8,"áno",null,"Tu píšeš mená, čisla reg.prukazov"]
[null,4,"Paška Tomáš",7968,"KK Moravské Lieskové",365,175,8,540,6,"áno",null,"klub, plné, chyby a celkom."]
[null,5,"Urban Jakub",554,"KK Pobedim",407,191,6,598,2,"áno",null,"Priebežne dáš vytlačiť."]
[null,6,"Vajer Michal",93,"KK Pobedim",381,201,5,582,3,"áno",null,"Dorážku a poradie NEVYPISOVAŤ !!!"]
[null,7,"Galbavý Ivan",206,"MKK Stará Turá",384,155,6,539,7,"áno"]
[null,8,"Čečot Rastislav",1054,"MKK Stará Turá",368,173,6,541,5,"áno",null,"Vzor písania hráča"]
[null,9,null,null,null,null,0,null,null,"","nie",null,"1- Priezvisko, 2- Meno"]
[null,10,null,null,null,null,0,null,null,"","nie",null,"Perecár Miroslav"]
[null,11,null,null,null,null,0,null,null,"","nie"]
[null,12,null,null,null,null,0,null,null,"","nie"]
[null,13,null,null,null,null,0,null,null,"","nie"]
[null,14,null,null,null,null,0,null,null,"","nie"]
[null,15,null,null,null,null,0,null,null,"","nie"]
[null,16,null,null,null,null,0,null,null,"","nie"]
[null,17,null,null,null,null,0,null,null,"","nie"]
[null,18,null,null,null,null,0,null,null,"","nie"]
[null,19,null,null,null,null,0,null,null,"","nie"]
[null,20,null,null,null,null,0,null,null,"","nie"]
[null,21,null,null,null,null,0,null,null,"","nie"]
[null,22,null,null,null,null,0,null,null,"","nie"]
[null,23,null,null,null,null,0,null,null,"","nie"]
[null,24,null,null,null,null,0,null,null,"","nie"]
[null,25,null,null,null,null,0,null,null,"","nie"]
[null,26,null,null,null,null,0,null,null,"","nie"]
[null,27,null,null,null,null,0,null,null,"","nie"]
[null,28,null,null,null,null,0,null,null,"","nie"]
[null,29,null,null,null,null,0,null,null,"","nie"]
[null,30,null,null,null,null,0,null,null,"","nie"]
[null,31,null,null,null,null,0,null,null,"","nie"]
[null,32,null,null,null,null,0,null,null,"","nie"]
[null,33,null,null,null,null,0,null,null,"","nie"]
[null,34,null,null,null,null,0,null,null,"","nie"]
[null,35,null,null,null,null,0,null,null,"","nie"]
[null,36,null,null,null,null,0,null,null,"","nie"]
[null,37,null,null,null,null,0,null,null,"","nie"]
[null,38,null,null,null,null,0,null,null,"","nie"]
[null,39,null,null,null,null,0,null,null,"","nie"]
[null,40,null,null,null,null,0,null,null,"","nie"]

{"sheet":"JuniorkyZáp","index":9,"n_rows":33,"n_cols":13,"rows_kept":33,"cut":false,"hidden":false,"merged":[[0,1,0,2],[3,12,4,13],[5,12,5,15],[6,12,6,15],[7,12,7,15],[0,5,0,9],[1,7,1,9],[0,12,0,14],[12,12,12,14],[10,12,10,14],[11,12,11,14],[8,12,8,15],[1,1,1,2],[1,4,1,6],[1,12,1,14]]}
[null,"MK - Juniorky",null,"U - 23","Kraj :","Trenčiansky",null,null,null,null,null,null,"Napísať Kraj"]
[null,2019,null,"kolkáreň :","Trenčín",null,null,"31.3.2019",null,null,null,null,"Kolkáreň a Dátum"]
[null,"Š.č.","Hráčka","Č.r.p.","Klub","Plné","Dor.","Ch.","Celkom","Porad."]
[null,1,"Martinčičová Radka",7713,"MKK Stará Turá",349,{"$f":"I4-F4","v":135},15,484,{"$f":"IF(I4=0,\"\",RANK(I4,$I$4:$I$33))","v":4},{"$f":"IF(I4=\"\",\"nie\",\"áno\")","v":"áno"},null,"  za 1."]
[null,2,"Kováčová Natália",8225,"MKK Stará Turá",367,{"$f":"I5-F5","v":171},7,538,2,{"$f":"IF(I5=\"\",\"nie\",\"áno\")","v":"áno"}]
[null,3,"Hupčíková Gabriela",596,"TKK Trenčín",373,185,2,558,1,"áno",null,"Tu píšeš mená, čisla reg.prukazov"]
[null,4,"Miklovičová Adriana",94,"KK Pobedim",356,151,4,507,3,"áno",null,"klub, plné, chyby a celkom."]
[null,5,"Koreňová Simona",597,"TKK Trenčín",null,{"$error":"#VALUE!"},null,"skreč",{"$error":"#VALUE!"},"áno",null,"Priebežne dáš vytlačiť."]
[null,6,null,null,null,null,0,null,null,"","nie",null,"Dorážku a poradie NEVYPISOVAŤ !!!"]
[null,7,null,null,null,null,0,null,null,"","nie"]
[null,8,null,null,null,null,0,null,null,"","nie",null,"Vzor písania hráčky"]
[null,9,null,null,null,null,0,null,null,"","nie",null,"1- Priezvisko, 2- Meno"]
[null,10,null,null,null,null,0,null,null,"","nie",null,"Perecárová  Miroslava"]
[null,11,null,null,null,null,0,null,null,"","nie"]
[null,12,null,null,null,null,0,null,null,"","nie"]
[null,13,null,null,null,null,0,null,null,"","nie"]
[null,14,null,null,null,null,0,null,null,"","nie"]
[null,15,null,null,null,null,0,null,null,"","nie"]
[null,16,null,null,null,null,0,null,null,"","nie"]
[null,17,null,null,null,null,0,null,null,"","nie"]
[null,18,null,null,null,null,0,null,null,"","nie"]
[null,19,null,null,null,null,0,null,null,"","nie"]
[null,20,null,null,null,null,0,null,null,"","nie"]
[null,21,null,null,null,null,0,null,null,"","nie"]
[null,22,null,null,null,null,0,null,null,"","nie"]
[null,23,null,null,null,null,0,null,null,"","nie"]
[null,24,null,null,null,null,0,null,null,"","nie"]
[null,25,null,null,null,null,0,null,null,"","nie"]
[null,26,null,null,null,null,0,null,null,"","nie"]
[null,27,null,null,null,null,0,null,null,"","nie"]
[null,28,null,null,null,null,0,null,null,"","nie"]
[null,29,null,null,null,null,0,null,null,"","nie"]
[null,30,null,null,null,null,0,null,null,"","nie"]

{"sheet":"DorciZáp","index":10,"n_rows":43,"n_cols":13,"rows_kept":43,"cut":false,"hidden":false,"merged":[[0,1,0,2],[3,12,4,13],[5,12,5,15],[6,12,6,15],[7,12,7,15],[0,5,0,9],[1,7,1,9],[0,12,0,14],[12,12,12,14],[10,12,10,14],[11,12,11,14],[8,12,8,15],[1,1,1,2],[1,4,1,6],[1,12,1,14]]}
[null,"MK - Dorastenci",null,"U - 18","Kraj :","Trenčiansky",null,null,null,null,null,null,"Napísať Kraj"]
[null,2019,null,"kolkáreň :","Stará Turá",null,null,"20.1.2019",null,null,null,null,"Kolkáreň a Dátum"]
[null,"Š.č.","Hráč","Č.r.p.","Klub","Plné","Dor.","Ch.","Celkom","Porad."]
[null,1,"Lehuta Filip",225,"MKK Stará Turá",371,{"$f":"I4-F4","v":156},17,527,{"$f":"IF(I4=0,\"\",RANK(I4,$I$4:$I$43))","v":4},{"$f":"IF(I4=\"\",\"nie\",\"áno\")","v":"áno"},null,"  za 1."]
[null,2,"Malíček Michal",1074,"KK Pobedím",415,159,5,574,1,{"$f":"IF(I5=\"\",\"nie\",\"áno\")","v":"áno"}]
[null,3,"Holota Matúš",1114,"MKK Stará Turá",355,146,9,501,5,"áno",null,"Tu píšeš mená, čisla reg.prukazov"]
[null,4,"Kotula Matúš",1112,"MKK Stará Turá",366,204,4,570,2,"áno",null,"klub, plné, chyby a celkom."]
[null,5,"Truhlík Dominik",1113,"MKK Stará Turá",373,179,8,552,3,"áno",null,"Priebežne dáš vytlačiť."]
[null,6,null,null,null,null,0,null,null,"","nie",null,"Dorážku a poradie NEVYPISOVAŤ !!!"]
[null,7,null,null,null,null,0,null,null,"","nie"]
[null,8,null,null,null,null,0,null,null,"","nie",null,"Vzor písania hráča"]
[null,9,null,null,null,null,0,null,null,"","nie",null,"1- Priezvisko, 2- Meno"]
[null,10,null,null,null,null,0,null,null,"","nie",null,"Perecár Miroslav"]
[null,11,null,null,null,null,0,null,null,"","nie"]
[null,12,null,null,null,null,0,null,null,"","nie"]
[null,13,null,null,null,null,0,null,null,"","nie"]
[null,14,null,null,null,null,0,null,null,"","nie"]
[null,15,null,null,null,null,0,null,null,"","nie"]
[null,16,null,null,null,null,0,null,null,"","nie"]
[null,17,null,null,null,null,0,null,null,"","nie"]
[null,18,null,null,null,null,0,null,null,"","nie"]
[null,19,null,null,null,null,0,null,null,"","nie"]
[null,20,null,null,null,null,0,null,null,"","nie"]
[null,21,null,null,null,null,0,null,null,"","nie"]
[null,22,null,null,null,null,0,null,null,"","nie"]
[null,23,null,null,null,null,0,null,null,"","nie"]
[null,24,null,null,null,null,0,null,null,"","nie"]
[null,25,null,null,null,null,0,null,null,"","nie"]
[null,26,null,null,null,null,0,null,null,"","nie"]
[null,27,null,null,null,null,0,null,null,"","nie"]
[null,28,null,null,null,null,0,null,null,"","nie"]
[null,29,null,null,null,null,0,null,null,"","nie"]
[null,30,null,null,null,null,0,null,null,"","nie"]
[null,31,null,null,null,null,0,null,null,"","nie"]
[null,32,null,null,null,null,0,null,null,"","nie"]
[null,33,null,null,null,null,0,null,null,"","nie"]
[null,34,null,null,null,null,0,null,null,"","nie"]
[null,35,null,null,null,null,0,null,null,"","nie"]
[null,36,null,null,null,null,0,null,null,"","nie"]
[null,37,null,null,null,null,0,null,null,"","nie"]
[null,38,null,null,null,null,0,null,null,"","nie"]
[null,39,null,null,null,null,0,null,null,"","nie"]
[null,40,null,null,null,null,0,null,null,"","nie"]

{"sheet":"DorkyZáp","index":11,"n_rows":33,"n_cols":13,"rows_kept":33,"cut":false,"hidden":false,"merged":[[0,1,0,2],[3,12,4,13],[5,12,5,15],[6,12,6,15],[7,12,7,15],[0,5,0,9],[1,7,1,9],[0,12,0,14],[12,12,12,14],[10,12,10,14],[11,12,11,14],[8,12,8,15],[1,1,1,2],[1,4,1,6],[1,12,1,14]]}
[null,"MK - Dorastenky",null,"U - 18","Kraj :","Trenčiansky",null,null,null,null,null,null,"Napísať Kraj"]
[null,2019,null,"kolkáreň :","Trenčín",null,null,"20.1.2019",null,null,null,null,"Kolkáreň a Dátum"]
[null,"Š.č.","Hráčka","Č.r.p.","Klub","Plné","Dor.","Ch.","Celkom","Porad."]
[null,1,"Balajová Karolína",8206,"TKK Trenčín",258,{"$f":"I4-F4","v":79},33,337,{"$f":"IF(I4=0,\"\",RANK(I4,$I$4:$I$33))","v":4},{"$f":"IF(I4=\"\",\"nie\",\"áno\")","v":"áno"},null,"  za 1."]
[null,2,"Hupčíková Erika",1116,"TKK Trenčín",320,{"$f":"I5-F5","v":118},17,438,3,{"$f":"IF(I5=\"\",\"nie\",\"áno\")","v":"áno"}]
[null,3,"Vávrová Vladimíra",5675,"Mkk Stará Turá",379,169,6,548,1,"áno",null,"Tu píšeš mená, čisla reg.prukazov"]
[null,4,"Mikušincová Veronika",7802,"TKK Trenčín",340,173,9,513,2,"áno",null,"klub, plné, chyby a celkom."]
[null,5,null,null,null,null,{"$f":"I8-F8","v":0},null,null,"","nie",null,"Priebežne dáš vytlačiť."]
[null,6,null,null,null,null,0,null,null,"","nie",null,"Dorážku a poradie NEVYPISOVAŤ !!!"]
[null,7,null,null,null,null,0,null,null,"","nie"]
[null,8,null,null,null,null,0,null,null,"","nie",null,"Vzor písania hráčky"]
[null,9,null,null,null,null,0,null,null,"","nie",null,"1- Priezvisko, 2- Meno"]
[null,10,null,null,null,null,0,null,null,"","nie",null,"Perecárová  Miroslava"]
[null,11,null,null,null,null,0,null,null,"","nie"]
[null,12,null,null,null,null,0,null,null,"","nie"]
[null,13,null,null,null,null,0,null,null,"","nie"]
[null,14,null,null,null,null,0,null,null,"","nie"]
[null,15,null,null,null,null,0,null,null,"","nie"]
[null,16,null,null,null,null,0,null,null,"","nie"]
[null,17,null,null,null,null,0,null,null,"","nie"]
[null,18,null,null,null,null,0,null,null,"","nie"]
[null,19,null,null,null,null,0,null,null,"","nie"]
[null,20,null,null,null,null,0,null,null,"","nie"]
[null,21,null,null,null,null,0,null,null,"","nie"]
[null,22,null,null,null,null,0,null,null,"","nie"]
[null,23,null,null,null,null,0,null,null,"","nie"]
[null,24,null,null,null,null,0,null,null,"","nie"]
[null,25,null,null,null,null,0,null,null,"","nie"]
[null,26,null,null,null,null,0,null,null,"","nie"]
[null,27,null,null,null,null,0,null,null,"","nie"]
[null,28,null,null,null,null,0,null,null,"","nie"]
[null,29,null,null,null,null,0,null,null,"","nie"]
[null,30,null,null,null,null,0,null,null,"","nie"]

{"sheet":"ŽiaciZáp","index":12,"n_rows":43,"n_cols":13,"rows_kept":43,"cut":false,"hidden":false,"merged":[[0,1,0,2],[3,12,4,13],[5,12,5,15],[6,12,6,15],[7,12,7,15],[0,5,0,9],[1,7,1,9],[0,12,0,14],[12,12,12,14],[10,12,10,14],[11,12,11,14],[8,12,8,15],[1,1,1,2],[1,4,1,6],[1,12,1,14]]}
[null,"MK - Žiaci",null,"U - 14","Kraj :","Trenčiansky",null,null,null,null,null,null,"Napísať Kraj"]
[null,2019,null,"kolkáreň :","Trenčín",null,null,"20.1.2019",null,null,null,null,"Kolkáreň a Dátum"]
[null,"Š.č.","Hráč","Č.r.p.","Klub","Plné","Dor.","Ch.","Celkom","Porad."]
[null,1,"Sulo Samuel",8201,"TKKTrenčín",147,{"$f":"I4-F4","v":57},9,204,{"$f":"IF(I4=0,\"\",RANK(I4,$I$4:$I$43))","v":3},{"$f":"IF(I4=\"\",\"nie\",\"áno\")","v":"áno"},null,"  za 1."]
[null,2,"Vandlík Tomáš",8223,"Mkk Sraá Turá",137,50,12,187,4,{"$f":"IF(I5=\"\",\"nie\",\"áno\")","v":"áno"}]
[null,3,"Slimák Samuel",7782,"KK Pobedim",153,30,16,183,5,"áno",null,"Tu píšeš mená, čisla reg.prukazov"]
[null,4,"Dúdik Samuel",1214,"KK Pobedim",167,84,3,251,1,"áno",null,"klub, plné, chyby a celkom."]
[null,5,"Pečenkár Ondrej",1235,"KK Pobedim",155,70,11,225,2,"áno",null,"Priebežne dáš vytlačiť."]
[null,6,null,null,null,null,0,null,null,"","nie",null,"Dorážku a poradie NEVYPISOVAŤ !!!"]
[null,7,null,null,null,null,0,null,null,"","nie"]
[null,8,null,null,null,null,0,null,null,"","nie",null,"Vzor písania hráča"]
[null,9,null,null,null,null,0,null,null,"","nie",null,"1- Priezvisko, 2- Meno"]
[null,10,null,null,null,null,0,null,null,"","nie",null,"Perecár Miroslav"]
[null,11,null,null,null,null,0,null,null,"","nie"]
[null,12,null,null,null,null,0,null,null,"","nie"]
[null,13,null,null,null,null,0,null,null,"","nie"]
[null,14,null,null,null,null,0,null,null,"","nie"]
[null,15,null,null,null,null,0,null,null,"","nie"]
[null,16,null,null,null,null,0,null,null,"","nie"]
[null,17,null,null,null,null,0,null,null,"","nie"]
[null,18,null,null,null,null,0,null,null,"","nie"]
[null,19,null,null,null,null,0,null,null,"","nie"]
[null,20,null,null,null,null,0,null,null,"","nie"]
[null,21,null,null,null,null,0,null,null,"","nie"]
[null,22,null,null,null,null,0,null,null,"","nie"]
[null,23,null,null,null,null,0,null,null,"","nie"]
[null,24,null,null,null,null,0,null,null,"","nie"]
[null,25,null,null,null,null,0,null,null,"","nie"]
[null,26,null,null,null,null,0,null,null,"","nie"]
[null,27,null,null,null,null,0,null,null,"","nie"]
[null,28,null,null,null,null,0,null,null,"","nie"]
[null,29,null,null,null,null,0,null,null,"","nie"]
[null,30,null,null,null,null,0,null,null,"","nie"]
[null,31,null,null,null,null,0,null,null,"","nie"]
[null,32,null,null,null,null,0,null,null,"","nie"]
[null,33,null,null,null,null,0,null,null,"","nie"]
[null,34,null,null,null,null,0,null,null,"","nie"]
[null,35,null,null,null,null,0,null,null,"","nie"]
[null,36,null,null,null,null,0,null,null,"","nie"]
[null,37,null,null,null,null,0,null,null,"","nie"]
[null,38,null,null,null,null,0,null,null,"","nie"]
[null,39,null,null,null,null,0,null,null,"","nie"]
[null,40,null,null,null,null,0,null,null,"","nie"]

{"sheet":"ŽiačkykyZáp","index":13,"n_rows":33,"n_cols":13,"rows_kept":33,"cut":false,"hidden":false,"merged":[[0,1,0,2],[3,12,4,13],[5,12,5,15],[6,12,6,15],[7,12,7,15],[0,5,0,9],[1,7,1,9],[0,12,0,14],[12,12,12,14],[10,12,10,14],[11,12,11,14],[8,12,8,15],[1,1,1,2],[1,4,1,6],[1,12,1,14]]}
[null,"MK - Žiačky",null,"U - 14","Kraj :","Trenčiansky",null,null,null,null,null,null,"Napísať Kraj"]
[null,2019,null,"kolkáreň :","Trenčín",null,null,"20.1.2019",null,null,null,null,"Kolkáreň a Dátum"]
[null,"Š.č.","Hráčka","Č.r.p.","Klub","Plné","Dor.","Ch.","Celkom","Porad."]
[null,1,"Mazániková Ema",8196,"TKK Trenčín",151,{"$f":"I4-F4","v":65},5,216,{"$f":"IF(I4=0,\"\",RANK(I4,$I$4:$I$33))","v":3},{"$f":"IF(I4=\"\",\"nie\",\"áno\")","v":"áno"},null,"  za 1."]
[null,2,"Jurčíková Alžbeta",8199,"TKK Trenčín",125,{"$f":"I5-F5","v":39},22,164,{"$f":"IF(I5=0,\"\",RANK(I5,$I$4:$I$33))","v":5},{"$f":"IF(I5=\"\",\"nie\",\"áno\")","v":"áno"}]
[null,3,"Malíčková Radoslava",1238,"KK Pobedim",163,68,10,231,{"$f":"IF(I6=0,\"\",RANK(I6,$I$4:$I$33))","v":1},"áno",null,"Tu píšeš mená, čisla reg.prukazov"]
[null,4,"Danková Sarah",8222,"MKK Stará Turá",147,55,9,202,4,"áno",null,"klub, plné, chyby a celkom."]
[null,5,"Koreňová Petra",1117,"TKK Trenčín",149,69,6,218,2,"áno",null,"Priebežne dáš vytlačiť."]
[null,6,"Pečenkárová Tatiana",8240,"KK Pobedim",99,41,21,140,6,"áno",null,"Dorážku a poradie NEVYPISOVAŤ !!!"]
[null,7,null,null,null,null,0,null,null,"","nie"]
[null,8,null,null,null,null,0,null,null,"","nie",null,"Vzor písania hráčky"]
[null,9,null,null,null,null,0,null,null,"","nie",null,"1- Priezvisko, 2- Meno"]
[null,10,null,null,null,null,0,null,null,"","nie",null,"Perecárová  Miroslava"]
[null,11,null,null,null,null,0,null,null,"","nie"]
[null,12,null,null,null,null,0,null,null,"","nie"]
[null,13,null,null,null,null,0,null,null,"","nie"]
[null,14,null,null,null,null,0,null,null,"","nie"]
[null,15,null,null,null,null,0,null,null,"","nie"]
[null,16,null,null,null,null,0,null,null,"","nie"]
[null,17,null,null,null,null,0,null,null,"","nie"]
[null,18,null,null,null,null,0,null,null,"","nie"]
[null,19,null,null,null,null,0,null,null,"","nie"]
[null,20,null,null,null,null,0,null,null,"","nie"]
[null,21,null,null,null,null,0,null,null,"","nie"]
[null,22,null,null,null,null,0,null,null,"","nie"]
[null,23,null,null,null,null,0,null,null,"","nie"]
[null,24,null,null,null,null,0,null,null,"","nie"]
[null,25,null,null,null,null,0,null,null,"","nie"]
[null,26,null,null,null,null,0,null,null,"","nie"]
[null,27,null,null,null,null,0,null,null,"","nie"]
[null,28,null,null,null,null,0,null,null,"","nie"]
[null,29,null,null,null,null,0,null,null,"","nie"]
[null,30,null,null,null,null,0,null,null,"","nie"]

{"sheet":"VýsledSpolu","index":14,"n_rows":539,"n_cols":16,"rows_kept":539,"cut":false,"hidden":false,"merged":[[294,6,294,8],[169,1,169,3],[115,5,115,8],[168,3,168,5],[168,6,168,8],[294,1,294,2],[259,5,259,8],[10,15,11,16],[12,15,12,17],[14,15,14,17],[15,15,15,17],[13,15,13,17],[0,6,0,8],[0,3,0,5],[1,1,1,3],[459,1,459,3],[78,1,78,2],[78,3,78,5],[78,6,78,8],[79,5,79,8],[114,3,114,5],[114,6,114,8],[114,1,114,2],[168,1,168,2],[169,5,169,8],[0,1,0,2],[1,5,1,8],[294,3,294,5],[79,1,79,3],[115,1,115,3],[505,1,505,3],[295,1,295,3],[341,1,341,3],[377,1,377,3],[504,1,504,2],[458,1,458,2],[422,1,422,2],[376,1,376,2],[340,6,340,8],[504,6,504,8],[340,1,340,2],[423,1,423,3],[341,5,341,8],[376,3,376,5],[376,6,376,8],[377,5,377,8],[422,3,422,5],[422,6,422,8],[423,5,423,8],[505,5,505,8],[204,1,204,2],[204,3,204,5],[204,6,204,8],[205,1,205,3],[205,5,205,8],[258,1,258,2],[258,3,258,5],[258,6,258,8],[259,1,259,3],[458,3,458,5],[458,6,458,8],[459,5,459,8],[504,3,504,5],[295,5,295,8],[340,3,340,5]]}
[null,"Kraj :",null,{"$f":"MužiZáp!$F$1","v":"Trenčiansky"},null,null,{"$f":"MužiZáp!$H$2","v":"31.3.2019"}]
[null,"MK mužov - 2019",null,null,"Kolkáreň :",{"$f":"MužiZáp!$E$2","v":"Stará Turá"}]
[]
[null,"Por.","Hráči","Č.r.p.","Klub","Plné","Dorážka","Chyby","Spolu"]
[]
[null,"1.",{"$f":"IF(MužiZáp!C20=0,\"\",MužiZáp!C20)","v":"Miklovič Jozef"},{"$f":"IF(MužiZáp!D20=0,\"\",MužiZáp!D20)","v":8010},{"$f":"IF(MužiZáp!E20=0,\"\",MužiZáp!E20)","v":"KK Pobedím"},{"$f":"IF(MužiZáp!F20=0,\"\",MužiZáp!F20)","v":405},{"$f":"IF(MužiZáp!G20=0,\"\",MužiZáp!G20)","v":257},{"$f":"IF(MužiZáp!H20=\"\",\"\",MužiZáp!H20)","v":1},{"$f":"IF(MužiZáp!I20=0,\"\",MužiZáp!I20)","v":662},{"$f":"MužiZáp!K20","v":"áno"}]
[null,"2.",{"$f":"IF(MužiZáp!C4=0,\"\",MužiZáp!C4)","v":"Truska Jaroslav"},{"$f":"IF(MužiZáp!D4=0,\"\",MužiZáp!D4)","v":8057},{"$f":"IF(MužiZáp!E4=0,\"\",MužiZáp!E4)","v":"TKK Trenčín"},{"$f":"IF(MužiZáp!F4=0,\"\",MužiZáp!F4)","v":408},{"$f":"IF(MužiZáp!G4=0,\"\",MužiZáp!G4)","v":251},{"$f":"IF(MužiZáp!H4=\"\",\"\",MužiZáp!H4)","v":0},{"$f":"IF(MužiZáp!I4=0,\"\",MužiZáp!I4)","v":659},{"$f":"MužiZáp!K4","v":"áno"}]
[null,"3.",{"$f":"IF(MužiZáp!C31=0,\"\",MužiZáp!C31)","v":"Truska Milan"},{"$f":"IF(MužiZáp!D31=0,\"\",MužiZáp!D31)","v":7967},{"$f":"IF(MužiZáp!E31=0,\"\",MužiZáp!E31)","v":"TKK Trenčín"},{"$f":"IF(MužiZáp!F31=0,\"\",MužiZáp!F31)","v":376},{"$f":"IF(MužiZáp!G31=0,\"\",MužiZáp!G31)","v":236},{"$f":"IF(MužiZáp!H31=\"\",\"\",MužiZáp!H31)","v":2},{"$f":"IF(MužiZáp!I31=0,\"\",MužiZáp!I31)","v":612},{"$f":"MužiZáp!K31","v":"áno"}]
[null,"4.",{"$f":"IF(MužiZáp!C12=0,\"\",MužiZáp!C12)","v":"Mikulec Marek"},{"$f":"IF(MužiZáp!D12=0,\"\",MužiZáp!D12)","v":7940},{"$f":"IF(MužiZáp!E12=0,\"\",MužiZáp!E12)","v":"DKK Nové Mesto nad Váhom"},{"$f":"IF(MužiZáp!F12=0,\"\",MužiZáp!F12)","v":384},{"$f":"IF(MužiZáp!G12=0,\"\",MužiZáp!G12)","v":210},{"$f":"IF(MužiZáp!H12=\"\",\"\",MužiZáp!H12)","v":1},{"$f":"IF(MužiZáp!I12=0,\"\",MužiZáp!I12)","v":594},{"$f":"MužiZáp!K12","v":"áno"}]
[null,"5.",{"$f":"IF(MužiZáp!C13=0,\"\",MužiZáp!C13)","v":"Sadloň Kamil"},{"$f":"IF(MužiZáp!D13=0,\"\",MužiZáp!D13)","v":7878},{"$f":"IF(MužiZáp!E13=0,\"\",MužiZáp!E13)","v":"MKK Stará Turá"},{"$f":"IF(MužiZáp!F13=0,\"\",MužiZáp!F13)","v":380},{"$f":"IF(MužiZáp!G13=0,\"\",MužiZáp!G13)","v":212},{"$f":"IF(MužiZáp!H13=\"\",\"\",MužiZáp!H13)","v":3},{"$f":"IF(MužiZáp!I13=0,\"\",MužiZáp!I13)","v":592},{"$f":"MužiZáp!K13","v":"áno"}]
[null,"6.",{"$f":"IF(MužiZáp!C33=0,\"\",MužiZáp!C33)","v":"Bročko Pavel"},{"$f":"IF(MužiZáp!D33=0,\"\",MužiZáp!D33)","v":1423},{"$f":"IF(MužiZáp!E33=0,\"\",MužiZáp!E33)","v":"BKK Bánovce n/B"},{"$f":"IF(MužiZáp!F33=0,\"\",MužiZáp!F33)","v":383},{"$f":"IF(MužiZáp!G33=0,\"\",MužiZáp!G33)","v":209},{"$f":"IF(MužiZáp!H33=\"\",\"\",MužiZáp!H33)","v":2},{"$f":"IF(MužiZáp!I33=0,\"\",MužiZáp!I33)","v":592},{"$f":"MužiZáp!K33","v":"áno"},null,null,null,null,null,"  za 1."]
[null,"7.",{"$f":"IF(MužiZáp!C17=0,\"\",MužiZáp!C17)","v":"Benko Michal"},{"$f":"IF(MužiZáp!D17=0,\"\",MužiZáp!D17)","v":226},{"$f":"IF(MužiZáp!E17=0,\"\",MužiZáp!E17)","v":"KK Pobedím"},{"$f":"IF(MužiZáp!F17=0,\"\",MužiZáp!F17)","v":394},{"$f":"IF(MužiZáp!G17=0,\"\",MužiZáp!G17)","v":192},{"$f":"IF(MužiZáp!H17=\"\",\"\",MužiZáp!H17)","v":3},{"$f":"IF(MužiZáp!I17=0,\"\",MužiZáp!I17)","v":586},{"$f":"MužiZáp!K17","v":"áno"}]
[null,"8.",{"$f":"IF(MužiZáp!C25=0,\"\",MužiZáp!C25)","v":"Huba Marián"},{"$f":"IF(MužiZáp!D25=0,\"\",MužiZáp!D25)","v":2152},{"$f":"IF(MužiZáp!E25=0,\"\",MužiZáp!E25)","v":"TKK Trenčín"},{"$f":"IF(MužiZáp!F25=0,\"\",MužiZáp!F25)","v":386},{"$f":"IF(MužiZáp!G25=0,\"\",MužiZáp!G25)","v":198},{"$f":"IF(MužiZáp!H25=\"\",\"\",MužiZáp!H25)","v":6},{"$f":"IF(MužiZáp!I25=0,\"\",MužiZáp!I25)","v":584},{"$f":"MužiZáp!K25","v":"áno"},null,null,null,null,null,"Stlačíš makrá na zoradenie"]
[null,"9.",{"$f":"IF(MužiZáp!C15=0,\"\",MužiZáp!C15)","v":"Nemček Peter"},{"$f":"IF(MužiZáp!D15=0,\"\",MužiZáp!D15)","v":297},{"$f":"IF(MužiZáp!E15=0,\"\",MužiZáp!E15)","v":"MKK Stará Turá"},{"$f":"IF(MužiZáp!F15=0,\"\",MužiZáp!F15)","v":375},{"$f":"IF(MužiZáp!G15=0,\"\",MužiZáp!G15)","v":208},{"$f":"IF(MužiZáp!H15=\"\",\"\",MužiZáp!H15)","v":2},{"$f":"IF(MužiZáp!I15=0,\"\",MužiZáp!I15)","v":583},{"$f":"MužiZáp!K15","v":"áno"},null,null,null,null,null,"všetkých kategórií"]
[null,"10.",{"$f":"IF(MužiZáp!C14=0,\"\",MužiZáp!C14)","v":"Hvožďara Peter"},{"$f":"IF(MužiZáp!D14=0,\"\",MužiZáp!D14)","v":112},{"$f":"IF(MužiZáp!E14=0,\"\",MužiZáp!E14)","v":"MKK Stará Turá"},{"$f":"IF(MužiZáp!F14=0,\"\",MužiZáp!F14)","v":378},{"$f":"IF(MužiZáp!G14=0,\"\",MužiZáp!G14)","v":205},{"$f":"IF(MužiZáp!H14=\"\",\"\",MužiZáp!H14)","v":2},{"$f":"IF(MužiZáp!I14=0,\"\",MužiZáp!I14)","v":583},{"$f":"MužiZáp!K14","v":"áno"},null,null,null,null,null,"a vytlačíš výsledky."]
[null,"11.",{"$f":"IF(MužiZáp!C19=0,\"\",MužiZáp!C19)","v":"Mrekaj Marek"},{"$f":"IF(MužiZáp!D19=0,\"\",MužiZáp!D19)","v":227},{"$f":"IF(MužiZáp!E19=0,\"\",MužiZáp!E19)","v":"KK Pobedím"},{"$f":"IF(MužiZáp!F19=0,\"\",MužiZáp!F19)","v":370},{"$f":"IF(MužiZáp!G19=0,\"\",MužiZáp!G19)","v":212},{"$f":"IF(MužiZáp!H19=\"\",\"\",MužiZáp!H19)","v":6},{"$f":"IF(MužiZáp!I19=0,\"\",MužiZáp!I19)","v":582},{"$f":"MužiZáp!K19","v":"áno"},null,null,null,null,null,"Tu sa nevypisuje  NIČ !!!"]
[null,"12.",{"$f":"IF(MužiZáp!C16=0,\"\",MužiZáp!C16)","v":"Minarech Roman"},{"$f":"IF(MužiZáp!D16=0,\"\",MužiZáp!D16)","v":7879},{"$f":"IF(MužiZáp!E16=0,\"\",MužiZáp!E16)","v":"MKK Stará Turá"},{"$f":"IF(MužiZáp!F16=0,\"\",MužiZáp!F16)","v":384},{"$f":"IF(MužiZáp!G16=0,\"\",MužiZáp!G16)","v":198},{"$f":"IF(MužiZáp!H16=\"\",\"\",MužiZáp!H16)","v":4},{"$f":"IF(MužiZáp!I16=0,\"\",MužiZáp!I16)","v":582},{"$f":"MužiZáp!K16","v":"áno"}]
[null,"13.",{"$f":"IF(MužiZáp!C29=0,\"\",MužiZáp!C29)","v":"Dzúrik Martin"},{"$f":"IF(MužiZáp!D29=0,\"\",MužiZáp!D29)","v":7958},{"$f":"IF(MužiZáp!E29=0,\"\",MužiZáp!E29)","v":"TKK Trenčín"},{"$f":"IF(MužiZáp!F29=0,\"\",MužiZáp!F29)","v":402},{"$f":"IF(MužiZáp!G29=0,\"\",MužiZáp!G29)","v":176},{"$f":"IF(MužiZáp!H29=\"\",\"\",MužiZáp!H29)","v":3},{"$f":"IF(MužiZáp!I29=0,\"\",MužiZáp!I29)","v":578},{"$f":"MužiZáp!K29","v":"áno"}]
[null,"14.",{"$f":"IF(MužiZáp!C7=0,\"\",MužiZáp!C7)","v":"Bielko Dušan"},{"$f":"IF(MužiZáp!D7=0,\"\",MužiZáp!D7)","v":8034},{"$f":"IF(MužiZáp!E7=0,\"\",MužiZáp!E7)","v":"DKK Nové Mesto nad Váhom"},{"$f":"IF(MužiZáp!F7=0,\"\",MužiZáp!F7)","v":381},{"$f":"IF(MužiZáp!G7=0,\"\",MužiZáp!G7)","v":193},{"$f":"IF(MužiZáp!H7=\"\",\"\",MužiZáp!H7)","v":4},{"$f":"IF(MužiZáp!I7=0,\"\",MužiZáp!I7)","v":574},{"$f":"MužiZáp!K7","v":"áno"}]
[null,"15.",{"$f":"IF(MužiZáp!C9=0,\"\",MužiZáp!C9)","v":"Hajaš Martin"},{"$f":"IF(MužiZáp!D9=0,\"\",MužiZáp!D9)","v":7789},{"$f":"IF(MužiZáp!E9=0,\"\",MužiZáp!E9)","v":"Dubnica"},{"$f":"IF(MužiZáp!F9=0,\"\",MužiZáp!F9)","v":358},{"$f":"IF(MužiZáp!G9=0,\"\",MužiZáp!G9)","v":204},{"$f":"IF(MužiZáp!H9=\"\",\"\",MužiZáp!H9)","v":4},{"$f":"IF(MužiZáp!I9=0,\"\",MužiZáp!I9)","v":562},{"$f":"MužiZáp!K9","v":"áno"}]
[null,"16.",{"$f":"IF(MužiZáp!C24=0,\"\",MužiZáp!C24)","v":"Kičinko Jakub"},{"$f":"IF(MužiZáp!D24=0,\"\",MužiZáp!D24)","v":64},{"$f":"IF(MužiZáp!E24=0,\"\",MužiZáp!E24)","v":"TKK Trenčín"},{"$f":"IF(MužiZáp!F24=0,\"\",MužiZáp!F24)","v":360},{"$f":"IF(MužiZáp!G24=0,\"\",MužiZáp!G24)","v":200},{"$f":"IF(MužiZáp!H24=\"\",\"\",MužiZáp!H24)","v":4},{"$f":"IF(MužiZáp!I24=0,\"\",MužiZáp!I24)","v":560},{"$f":"MužiZáp!K24","v":"áno"}]
[null,"17.",{"$f":"IF(MužiZáp!C26=0,\"\",MužiZáp!C26)","v":"Sirotný Pavel"},{"$f":"IF(MužiZáp!D26=0,\"\",MužiZáp!D26)","v":754},{"$f":"IF(MužiZáp!E26=0,\"\",MužiZáp!E26)","v":"KK Hustra Uhrovec"},{"$f":"IF(MužiZáp!F26=0,\"\",MužiZáp!F26)","v":368},{"$f":"IF(MužiZáp!G26=0,\"\",MužiZáp!G26)","v":187},{"$f":"IF(MužiZáp!H26=\"\",\"\",MužiZáp!H26)","v":6},{"$f":"IF(MužiZáp!I26=0,\"\",MužiZáp!I26)","v":555},{"$f":"MužiZáp!K26","v":"áno"}]
[null,"18.",{"$f":"IF(MužiZáp!C6=0,\"\",MužiZáp!C6)","v":"Varga Eduard"},{"$f":"IF(MužiZáp!D6=0,\"\",MužiZáp!D6)","v":7969},{"$f":"IF(MužiZáp!E6=0,\"\",MužiZáp!E6)","v":"TKK Trenčín"},{"$f":"IF(MužiZáp!F6=0,\"\",MužiZáp!F6)","v":366},{"$f":"IF(MužiZáp!G6=0,\"\",MužiZáp!G6)","v":184},{"$f":"IF(MužiZáp!H6=\"\",\"\",MužiZáp!H6)","v":3},{"$f":"IF(MužiZáp!I6=0,\"\",MužiZáp!I6)","v":550},{"$f":"MužiZáp!K6","v":"áno"}]
[null,"19.",{"$f":"IF(MužiZáp!C23=0,\"\",MužiZáp!C23)","v":"Bednár Ľubomír"},{"$f":"IF(MužiZáp!D23=0,\"\",MužiZáp!D23)","v":1446},{"$f":"IF(MužiZáp!E23=0,\"\",MužiZáp!E23)","v":"MKK Stará Turá"},{"$f":"IF(MužiZáp!F23=0,\"\",MužiZáp!F23)","v":366},{"$f":"IF(MužiZáp!G23=0,\"\",MužiZáp!G23)","v":181},{"$f":"IF(MužiZáp!H23=\"\",\"\",MužiZáp!H23)","v":3},{"$f":"IF(MužiZáp!I23=0,\"\",MužiZáp!I23)","v":547},{"$f":"MužiZáp!K23","v":"áno"}]
[null,"20.",{"$f":"IF(MužiZáp!C10=0,\"\",MužiZáp!C10)","v":"Švaro Jaroslav"},{"$f":"IF(MužiZáp!D10=0,\"\",MužiZáp!D10)","v":7756},{"$f":"IF(MužiZáp!E10=0,\"\",MužiZáp!E10)","v":"DKK Nové Mesto nad Váhom"},{"$f":"IF(MužiZáp!F10=0,\"\",MužiZáp!F10)","v":374},{"$f":"IF(MužiZáp!G10=0,\"\",MužiZáp!G10)","v":168},{"$f":"IF(MužiZáp!H10=\"\",\"\",MužiZáp!H10)","v":6},{"$f":"IF(MužiZáp!I10=0,\"\",MužiZáp!I10)","v":542},{"$f":"MužiZáp!K10","v":"áno"}]
[null,"21.",{"$f":"IF(MužiZáp!C30=0,\"\",MužiZáp!C30)","v":"Jorík Pavol"},{"$f":"IF(MužiZáp!D30=0,\"\",MužiZáp!D30)","v":2},{"$f":"IF(MužiZáp!E30=0,\"\",MužiZáp!E30)","v":"TKK Trenčín"},{"$f":"IF(MužiZáp!F30=0,\"\",MužiZáp!F30)","v":361},{"$f":"IF(MužiZáp!G30=0,\"\",MužiZáp!G30)","v":180},{"$f":"IF(MužiZáp!H30=\"\",\"\",MužiZáp!H30)","v":6},{"$f":"IF(MužiZáp!I30=0,\"\",MužiZáp!I30)","v":541},{"$f":"MužiZáp!K30","v":"áno"}]
[null,"22.",{"$f":"IF(MužiZáp!C18=0,\"\",MužiZáp!C18)","v":"Žitňanský Ivan"},{"$f":"IF(MužiZáp!D18=0,\"\",MužiZáp!D18)","v":20},{"$f":"IF(MužiZáp!E18=0,\"\",MužiZáp!E18)","v":"KK Pobedím"},{"$f":"IF(MužiZáp!F18=0,\"\",MužiZáp!F18)","v":386},{"$f":"IF(MužiZáp!G18=0,\"\",MužiZáp!G18)","v":153},{"$f":"IF(MužiZáp!H18=\"\",\"\",MužiZáp!H18)","v":4},{"$f":"IF(MužiZáp!I18=0,\"\",MužiZáp!I18)","v":539},{"$f":"MužiZáp!K18","v":"áno"}]
[null,"23.",{"$f":"IF(MužiZáp!C34=0,\"\",MužiZáp!C34)","v":"Pecháček Roman"},{"$f":"IF(MužiZáp!D34=0,\"\",MužiZáp!D34)","v":8045},{"$f":"IF(MužiZáp!E34=0,\"\",MužiZáp!E34)","v":"MKK Stará Turá"},{"$f":"IF(MužiZáp!F34=0,\"\",MužiZáp!F34)","v":364},{"$f":"IF(MužiZáp!G34=0,\"\",MužiZáp!G34)","v":174},{"$f":"IF(MužiZáp!H34=\"\",\"\",MužiZáp!H34)","v":10},{"$f":"IF(MužiZáp!I34=0,\"\",MužiZáp!I34)","v":538},{"$f":"MužiZáp!K34","v":"áno"}]
[null,"24.",{"$f":"IF(MužiZáp!C8=0,\"\",MužiZáp!C8)","v":"Moško Rastislav"},{"$f":"IF(MužiZáp!D8=0,\"\",MužiZáp!D8)","v":8046},{"$f":"IF(MužiZáp!E8=0,\"\",MužiZáp!E8)","v":"Dubnica"},{"$f":"IF(MužiZáp!F8=0,\"\",MužiZáp!F8)","v":365},{"$f":"IF(MužiZáp!G8=0,\"\",MužiZáp!G8)","v":169},{"$f":"IF(MužiZáp!H8=\"\",\"\",MužiZáp!H8)","v":13},{"$f":"IF(MužiZáp!I8=0,\"\",MužiZáp!I8)","v":534},{"$f":"MužiZáp!K8","v":"áno"}]
[null,"25.",{"$f":"IF(MužiZáp!C11=0,\"\",MužiZáp!C11)","v":"Vojtek Peter"},{"$f":"IF(MužiZáp!D11=0,\"\",MužiZáp!D11)","v":564},{"$f":"IF(MužiZáp!E11=0,\"\",MužiZáp!E11)","v":"DKK Nové Mesto nad Váhom"},{"$f":"IF(MužiZáp!F11=0,\"\",MužiZáp!F11)","v":358},{"$f":"IF(MužiZáp!G11=0,\"\",MužiZáp!G11)","v":174},{"$f":"IF(MužiZáp!H11=\"\",\"\",MužiZáp!H11)","v":3},{"$f":"IF(MužiZáp!I11=0,\"\",MužiZáp!I11)","v":532},{"$f":"MužiZáp!K11","v":"áno"}]
[null,"26.",{"$f":"IF(MužiZáp!C35=0,\"\",MužiZáp!C35)","v":"Bača Miroslav"},{"$f":"IF(MužiZáp!D35=0,\"\",MužiZáp!D35)","v":8134},{"$f":"IF(MužiZáp!E35=0,\"\",MužiZáp!E35)","v":"KK Moravké Lieskové"},{"$f":"IF(MužiZáp!F35=0,\"\",MužiZáp!F35)","v":371},{"$f":"IF(MužiZáp!G35=0,\"\",MužiZáp!G35)","v":158},{"$f":"IF(MužiZáp!H35=\"\",\"\",MužiZáp!H35)","v":8},{"$f":"IF(MužiZáp!I35=0,\"\",MužiZáp!I35)","v":529},{"$f":"MužiZáp!K35","v":"áno"}]
[null,"27.",{"$f":"IF(MužiZáp!C21=0,\"\",MužiZáp!C21)","v":"Černý Pavol"},{"$f":"IF(MužiZáp!D21=0,\"\",MužiZáp!D21)","v":2663},{"$f":"IF(MužiZáp!E21=0,\"\",MužiZáp!E21)","v":"KK Pobedím"},{"$f":"IF(MužiZáp!F21=0,\"\",MužiZáp!F21)","v":354},{"$f":"IF(MužiZáp!G21=0,\"\",MužiZáp!G21)","v":168},{"$f":"IF(MužiZáp!H21=\"\",\"\",MužiZáp!H21)","v":5},{"$f":"IF(MužiZáp!I21=0,\"\",MužiZáp!I21)","v":522},{"$f":"MužiZáp!K21","v":"áno"}]
[null,"28.",{"$f":"IF(MužiZáp!C22=0,\"\",MužiZáp!C22)","v":"Kellner Peter"},{"$f":"IF(MužiZáp!D22=0,\"\",MužiZáp!D22)","v":2130},{"$f":"IF(MužiZáp!E22=0,\"\",MužiZáp!E22)","v":"TKK Trenčín"},{"$f":"IF(MužiZáp!F22=0,\"\",MužiZáp!F22)","v":369},{"$f":"IF(MužiZáp!G22=0,\"\",MužiZáp!G22)","v":152},{"$f":"IF(MužiZáp!H22=\"\",\"\",MužiZáp!H22)","v":7},{"$f":"IF(MužiZáp!I22=0,\"\",MužiZáp!I22)","v":521},{"$f":"MužiZáp!K22","v":"áno"}]
[null,"29.",{"$f":"IF(MužiZáp!C5=0,\"\",MužiZáp!C5)","v":"Truska Tomáš"},{"$f":"IF(MužiZáp!D5=0,\"\",MužiZáp!D5)","v":7968},{"$f":"IF(MužiZáp!E5=0,\"\",MužiZáp!E5)","v":"TKK Trenčín"},{"$f":"IF(MužiZáp!F5=0,\"\",MužiZáp!F5)","v":352},{"$f":"IF(MužiZáp!G5=0,\"\",MužiZáp!G5)","v":168},{"$f":"IF(MužiZáp!H5=\"\",\"\",MužiZáp!H5)","v":8},{"$f":"IF(MužiZáp!I5=0,\"\",MužiZáp!I5)","v":520},{"$f":"MužiZáp!K5","v":"áno"}]
[null,"30.",{"$f":"IF(MužiZáp!C28=0,\"\",MužiZáp!C28)","v":"Mišina Juraj"},{"$f":"IF(MužiZáp!D28=0,\"\",MužiZáp!D28)","v":544},{"$f":"IF(MužiZáp!E28=0,\"\",MužiZáp!E28)","v":"KK Hustra Uhrovec"},{"$f":"IF(MužiZáp!F28=0,\"\",MužiZáp!F28)","v":366},{"$f":"IF(MužiZáp!G28=0,\"\",MužiZáp!G28)","v":152},{"$f":"IF(MužiZáp!H28=\"\",\"\",MužiZáp!H28)","v":9},{"$f":"IF(MužiZáp!I28=0,\"\",MužiZáp!I28)","v":518},{"$f":"MužiZáp!K28","v":"áno"}]
[null,"31.",{"$f":"IF(MužiZáp!C27=0,\"\",MužiZáp!C27)","v":"Dubravický Ján"},{"$f":"IF(MužiZáp!D27=0,\"\",MužiZáp!D27)","v":2658},{"$f":"IF(MužiZáp!E27=0,\"\",MužiZáp!E27)","v":"KK Hustra Uhrovec"},{"$f":"IF(MužiZáp!F27=0,\"\",MužiZáp!F27)","v":351},{"$f":"IF(MužiZáp!G27=0,\"\",MužiZáp!G27)","v":157},{"$f":"IF(MužiZáp!H27=\"\",\"\",MužiZáp!H27)","v":10},{"$f":"IF(MužiZáp!I27=0,\"\",MužiZáp!I27)","v":508},{"$f":"MužiZáp!K27","v":"áno"}]
[null,"32.",{"$f":"IF(MužiZáp!C32=0,\"\",MužiZáp!C32)","v":"Papšo Michal"},{"$f":"IF(MužiZáp!D32=0,\"\",MužiZáp!D32)","v":549},{"$f":"IF(MužiZáp!E32=0,\"\",MužiZáp!E32)","v":"BKK Bánovce n/B"},{"$f":"IF(MužiZáp!F32=0,\"\",MužiZáp!F32)","v":358},{"$f":"IF(MužiZáp!G32=0,\"\",MužiZáp!G32)","v":141},{"$f":"IF(MužiZáp!H32=\"\",\"\",MužiZáp!H32)","v":8},{"$f":"IF(MužiZáp!I32=0,\"\",MužiZáp!I32)","v":499},{"$f":"MužiZáp!K32","v":"áno"}]
[null,"33.",{"$f":"IF(MužiZáp!C36=0,\"\",MužiZáp!C36)","v":""},{"$f":"IF(MužiZáp!D36=0,\"\",MužiZáp!D36)","v":""},{"$f":"IF(MužiZáp!E36=0,\"\",MužiZáp!E36)","v":""},{"$f":"IF(MužiZáp!F36=0,\"\",MužiZáp!F36)","v":""},{"$f":"IF(MužiZáp!G36=0,\"\",MužiZáp!G36)","v":""},{"$f":"IF(MužiZáp!H36=\"\",\"\",MužiZáp!H36)","v":""},{"$f":"IF(MužiZáp!I36=0,\"\",MužiZáp!I36)","v":""},{"$f":"MužiZáp!K36","v":"nie"}]
[null,"34.",{"$f":"IF(MužiZáp!C37=0,\"\",MužiZáp!C37)","v":""},{"$f":"IF(MužiZáp!D37=0,\"\",MužiZáp!D37)","v":""},{"$f":"IF(MužiZáp!E37=0,\"\",MužiZáp!E37)","v":""},{"$f":"IF(MužiZáp!F37=0,\"\",MužiZáp!F37)","v":""},{"$f":"IF(MužiZáp!G37=0,\"\",MužiZáp!G37)","v":""},{"$f":"IF(MužiZáp!H37=\"\",\"\",MužiZáp!H37)","v":""},{"$f":"IF(MužiZáp!I37=0,\"\",MužiZáp!I37)","v":""},{"$f":"MužiZáp!K37","v":"nie"}]
[null,"35.",{"$f":"IF(MužiZáp!C38=0,\"\",MužiZáp!C38)","v":""},{"$f":"IF(MužiZáp!D38=0,\"\",MužiZáp!D38)","v":""},{"$f":"IF(MužiZáp!E38=0,\"\",MužiZáp!E38)","v":""},{"$f":"IF(MužiZáp!F38=0,\"\",MužiZáp!F38)","v":""},{"$f":"IF(MužiZáp!G38=0,\"\",MužiZáp!G38)","v":""},{"$f":"IF(MužiZáp!H38=\"\",\"\",MužiZáp!H38)","v":""},{"$f":"IF(MužiZáp!I38=0,\"\",MužiZáp!I38)","v":""},{"$f":"MužiZáp!K38","v":"nie"}]
[null,"36.",{"$f":"IF(MužiZáp!C39=0,\"\",MužiZáp!C39)","v":""},{"$f":"IF(MužiZáp!D39=0,\"\",MužiZáp!D39)","v":""},{"$f":"IF(MužiZáp!E39=0,\"\",MužiZáp!E39)","v":""},{"$f":"IF(MužiZáp!F39=0,\"\",MužiZáp!F39)","v":""},{"$f":"IF(MužiZáp!G39=0,\"\",MužiZáp!G39)","v":""},{"$f":"IF(MužiZáp!H39=\"\",\"\",MužiZáp!H39)","v":""},{"$f":"IF(MužiZáp!I39=0,\"\",MužiZáp!I39)","v":""},{"$f":"MužiZáp!K39","v":"nie"}]
[null,"37.",{"$f":"IF(MužiZáp!C40=0,\"\",MužiZáp!C40)","v":""},{"$f":"IF(MužiZáp!D40=0,\"\",MužiZáp!D40)","v":""},{"$f":"IF(MužiZáp!E40=0,\"\",MužiZáp!E40)","v":""},{"$f":"IF(MužiZáp!F40=0,\"\",MužiZáp!F40)","v":""},{"$f":"IF(MužiZáp!G40=0,\"\",MužiZáp!G40)","v":""},{"$f":"IF(MužiZáp!H40=\"\",\"\",MužiZáp!H40)","v":""},{"$f":"IF(MužiZáp!I40=0,\"\",MužiZáp!I40)","v":""},{"$f":"MužiZáp!K40","v":"nie"}]
[null,"38.",{"$f":"IF(MužiZáp!C41=0,\"\",MužiZáp!C41)","v":""},{"$f":"IF(MužiZáp!D41=0,\"\",MužiZáp!D41)","v":""},{"$f":"IF(MužiZáp!E41=0,\"\",MužiZáp!E41)","v":""},{"$f":"IF(MužiZáp!F41=0,\"\",MužiZáp!F41)","v":""},{"$f":"IF(MužiZáp!G41=0,\"\",MužiZáp!G41)","v":""},{"$f":"IF(MužiZáp!H41=\"\",\"\",MužiZáp!H41)","v":""},{"$f":"IF(MužiZáp!I41=0,\"\",MužiZáp!I41)","v":""},{"$f":"MužiZáp!K41","v":"nie"}]
[null,"39.",{"$f":"IF(MužiZáp!C42=0,\"\",MužiZáp!C42)","v":""},{"$f":"IF(MužiZáp!D42=0,\"\",MužiZáp!D42)","v":""},{"$f":"IF(MužiZáp!E42=0,\"\",MužiZáp!E42)","v":""},{"$f":"IF(MužiZáp!F42=0,\"\",MužiZáp!F42)","v":""},{"$f":"IF(MužiZáp!G42=0,\"\",MužiZáp!G42)","v":""},{"$f":"IF(MužiZáp!H42=\"\",\"\",MužiZáp!H42)","v":""},{"$f":"IF(MužiZáp!I42=0,\"\",MužiZáp!I42)","v":""},{"$f":"MužiZáp!K42","v":"nie"}]
[null,"40.",{"$f":"IF(MužiZáp!C43=0,\"\",MužiZáp!C43)","v":""},{"$f":"IF(MužiZáp!D43=0,\"\",MužiZáp!D43)","v":""},{"$f":"IF(MužiZáp!E43=0,\"\",MužiZáp!E43)","v":""},{"$f":"IF(MužiZáp!F43=0,\"\",MužiZáp!F43)","v":""},{"$f":"IF(MužiZáp!G43=0,\"\",MužiZáp!G43)","v":""},{"$f":"IF(MužiZáp!H43=\"\",\"\",MužiZáp!H43)","v":""},{"$f":"IF(MužiZáp!I43=0,\"\",MužiZáp!I43)","v":""},{"$f":"MužiZáp!K43","v":"nie"}]
[null,"41.",{"$f":"IF(MužiZáp!C44=0,\"\",MužiZáp!C44)","v":""},{"$f":"IF(MužiZáp!D44=0,\"\",MužiZáp!D44)","v":""},{"$f":"IF(MužiZáp!E44=0,\"\",MužiZáp!E44)","v":""},{"$f":"IF(MužiZáp!F44=0,\"\",MužiZáp!F44)","v":""},{"$f":"IF(MužiZáp!G44=0,\"\",MužiZáp!G44)","v":""},{"$f":"IF(MužiZáp!H44=\"\",\"\",MužiZáp!H44)","v":""},{"$f":"IF(MužiZáp!I44=0,\"\",MužiZáp!I44)","v":""},{"$f":"MužiZáp!K44","v":"nie"}]
[null,"42.",{"$f":"IF(MužiZáp!C45=0,\"\",MužiZáp!C45)","v":""},{"$f":"IF(MužiZáp!D45=0,\"\",MužiZáp!D45)","v":""},{"$f":"IF(MužiZáp!E45=0,\"\",MužiZáp!E45)","v":""},{"$f":"IF(MužiZáp!F45=0,\"\",MužiZáp!F45)","v":""},{"$f":"IF(MužiZáp!G45=0,\"\",MužiZáp!G45)","v":""},{"$f":"IF(MužiZáp!H45=\"\",\"\",MužiZáp!H45)","v":""},{"$f":"IF(MužiZáp!I45=0,\"\",MužiZáp!I45)","v":""},{"$f":"MužiZáp!K45","v":"nie"}]
[null,"43.",{"$f":"IF(MužiZáp!C46=0,\"\",MužiZáp!C46)","v":""},{"$f":"IF(MužiZáp!D46=0,\"\",MužiZáp!D46)","v":""},{"$f":"IF(MužiZáp!E46=0,\"\",MužiZáp!E46)","v":""},{"$f":"IF(MužiZáp!F46=0,\"\",MužiZáp!F46)","v":""},{"$f":"IF(MužiZáp!G46=0,\"\",MužiZáp!G46)","v":""},{"$f":"IF(MužiZáp!H46=\"\",\"\",MužiZáp!H46)","v":""},{"$f":"IF(MužiZáp!I46=0,\"\",MužiZáp!I46)","v":""},{"$f":"MužiZáp!K46","v":"nie"}]
[null,"44.",{"$f":"IF(MužiZáp!C47=0,\"\",MužiZáp!C47)","v":""},{"$f":"IF(MužiZáp!D47=0,\"\",MužiZáp!D47)","v":""},{"$f":"IF(MužiZáp!E47=0,\"\",MužiZáp!E47)","v":""},{"$f":"IF(MužiZáp!F47=0,\"\",MužiZáp!F47)","v":""},{"$f":"IF(MužiZáp!G47=0,\"\",MužiZáp!G47)","v":""},{"$f":"IF(MužiZáp!H47=\"\",\"\",MužiZáp!H47)","v":""},{"$f":"IF(MužiZáp!I47=0,\"\",MužiZáp!I47)","v":""},{"$f":"MužiZáp!K47","v":"nie"}]
[null,"45.",{"$f":"IF(MužiZáp!C48=0,\"\",MužiZáp!C48)","v":""},{"$f":"IF(MužiZáp!D48=0,\"\",MužiZáp!D48)","v":""},{"$f":"IF(MužiZáp!E48=0,\"\",MužiZáp!E48)","v":""},{"$f":"IF(MužiZáp!F48=0,\"\",MužiZáp!F48)","v":""},{"$f":"IF(MužiZáp!G48=0,\"\",MužiZáp!G48)","v":""},{"$f":"IF(MužiZáp!H48=\"\",\"\",MužiZáp!H48)","v":""},{"$f":"IF(MužiZáp!I48=0,\"\",MužiZáp!I48)","v":""},{"$f":"MužiZáp!K48","v":"nie"}]
[null,"46.",{"$f":"IF(MužiZáp!C49=0,\"\",MužiZáp!C49)","v":""},{"$f":"IF(MužiZáp!D49=0,\"\",MužiZáp!D49)","v":""},{"$f":"IF(MužiZáp!E49=0,\"\",MužiZáp!E49)","v":""},{"$f":"IF(MužiZáp!F49=0,\"\",MužiZáp!F49)","v":""},{"$f":"IF(MužiZáp!G49=0,\"\",MužiZáp!G49)","v":""},{"$f":"IF(MužiZáp!H49=\"\",\"\",MužiZáp!H49)","v":""},{"$f":"IF(MužiZáp!I49=0,\"\",MužiZáp!I49)","v":""},{"$f":"MužiZáp!K49","v":"nie"}]
[null,"47.",{"$f":"IF(MužiZáp!C50=0,\"\",MužiZáp!C50)","v":""},{"$f":"IF(MužiZáp!D50=0,\"\",MužiZáp!D50)","v":""},{"$f":"IF(MužiZáp!E50=0,\"\",MužiZáp!E50)","v":""},{"$f":"IF(MužiZáp!F50=0,\"\",MužiZáp!F50)","v":""},{"$f":"IF(MužiZáp!G50=0,\"\",MužiZáp!G50)","v":""},{"$f":"IF(MužiZáp!H50=\"\",\"\",MužiZáp!H50)","v":""},{"$f":"IF(MužiZáp!I50=0,\"\",MužiZáp!I50)","v":""},{"$f":"MužiZáp!K50","v":"nie"}]
[null,"48.",{"$f":"IF(MužiZáp!C51=0,\"\",MužiZáp!C51)","v":""},{"$f":"IF(MužiZáp!D51=0,\"\",MužiZáp!D51)","v":""},{"$f":"IF(MužiZáp!E51=0,\"\",MužiZáp!E51)","v":""},{"$f":"IF(MužiZáp!F51=0,\"\",MužiZáp!F51)","v":""},{"$f":"IF(MužiZáp!G51=0,\"\",MužiZáp!G51)","v":""},{"$f":"IF(MužiZáp!H51=\"\",\"\",MužiZáp!H51)","v":""},{"$f":"IF(MužiZáp!I51=0,\"\",MužiZáp!I51)","v":""},{"$f":"MužiZáp!K51","v":"nie"}]
[null,"49.",{"$f":"IF(MužiZáp!C52=0,\"\",MužiZáp!C52)","v":""},{"$f":"IF(MužiZáp!D52=0,\"\",MužiZáp!D52)","v":""},{"$f":"IF(MužiZáp!E52=0,\"\",MužiZáp!E52)","v":""},{"$f":"IF(MužiZáp!F52=0,\"\",MužiZáp!F52)","v":""},{"$f":"IF(MužiZáp!G52=0,\"\",MužiZáp!G52)","v":""},{"$f":"IF(MužiZáp!H52=\"\",\"\",MužiZáp!H52)","v":""},{"$f":"IF(MužiZáp!I52=0,\"\",MužiZáp!I52)","v":""},{"$f":"MužiZáp!K52","v":"nie"}]
[null,"50.",{"$f":"IF(MužiZáp!C53=0,\"\",MužiZáp!C53)","v":""},{"$f":"IF(MužiZáp!D53=0,\"\",MužiZáp!D53)","v":""},{"$f":"IF(MužiZáp!E53=0,\"\",MužiZáp!E53)","v":""},{"$f":"IF(MužiZáp!F53=0,\"\",MužiZáp!F53)","v":""},{"$f":"IF(MužiZáp!G53=0,\"\",MužiZáp!G53)","v":""},{"$f":"IF(MužiZáp!H53=\"\",\"\",MužiZáp!H53)","v":""},{"$f":"IF(MužiZáp!I53=0,\"\",MužiZáp!I53)","v":""},{"$f":"MužiZáp!K53","v":"nie"}]
[null,"51.",{"$f":"IF(MužiZáp!C54=0,\"\",MužiZáp!C54)","v":""},{"$f":"IF(MužiZáp!D54=0,\"\",MužiZáp!D54)","v":""},{"$f":"IF(MužiZáp!E54=0,\"\",MužiZáp!E54)","v":""},{"$f":"IF(MužiZáp!F54=0,\"\",MužiZáp!F54)","v":""},{"$f":"IF(MužiZáp!G54=0,\"\",MužiZáp!G54)","v":""},{"$f":"IF(MužiZáp!H54=\"\",\"\",MužiZáp!H54)","v":""},{"$f":"IF(MužiZáp!I54=0,\"\",MužiZáp!I54)","v":""},{"$f":"MužiZáp!K54","v":"nie"}]
[null,"52.",{"$f":"IF(MužiZáp!C55=0,\"\",MužiZáp!C55)","v":""},{"$f":"IF(MužiZáp!D55=0,\"\",MužiZáp!D55)","v":""},{"$f":"IF(MužiZáp!E55=0,\"\",MužiZáp!E55)","v":""},{"$f":"IF(MužiZáp!F55=0,\"\",MužiZáp!F55)","v":""},{"$f":"IF(MužiZáp!G55=0,\"\",MužiZáp!G55)","v":""},{"$f":"IF(MužiZáp!H55=\"\",\"\",MužiZáp!H55)","v":""},{"$f":"IF(MužiZáp!I55=0,\"\",MužiZáp!I55)","v":""},{"$f":"MužiZáp!K55","v":"nie"}]
[null,"53.",{"$f":"IF(MužiZáp!C56=0,\"\",MužiZáp!C56)","v":""},{"$f":"IF(MužiZáp!D56=0,\"\",MužiZáp!D56)","v":""},{"$f":"IF(MužiZáp!E56=0,\"\",MužiZáp!E56)","v":""},{"$f":"IF(MužiZáp!F56=0,\"\",MužiZáp!F56)","v":""},{"$f":"IF(MužiZáp!G56=0,\"\",MužiZáp!G56)","v":""},{"$f":"IF(MužiZáp!H56=\"\",\"\",MužiZáp!H56)","v":""},{"$f":"IF(MužiZáp!I56=0,\"\",MužiZáp!I56)","v":""},{"$f":"MužiZáp!K56","v":"nie"}]
[null,"54.",{"$f":"IF(MužiZáp!C57=0,\"\",MužiZáp!C57)","v":""},{"$f":"IF(MužiZáp!D57=0,\"\",MužiZáp!D57)","v":""},{"$f":"IF(MužiZáp!E57=0,\"\",MužiZáp!E57)","v":""},{"$f":"IF(MužiZáp!F57=0,\"\",MužiZáp!F57)","v":""},{"$f":"IF(MužiZáp!G57=0,\"\",MužiZáp!G57)","v":""},{"$f":"IF(MužiZáp!H57=\"\",\"\",MužiZáp!H57)","v":""},{"$f":"IF(MužiZáp!I57=0,\"\",MužiZáp!I57)","v":""},{"$f":"MužiZáp!K57","v":"nie"}]
[null,"55.",{"$f":"IF(MužiZáp!C58=0,\"\",MužiZáp!C58)","v":""},{"$f":"IF(MužiZáp!D58=0,\"\",MužiZáp!D58)","v":""},{"$f":"IF(MužiZáp!E58=0,\"\",MužiZáp!E58)","v":""},{"$f":"IF(MužiZáp!F58=0,\"\",MužiZáp!F58)","v":""},{"$f":"IF(MužiZáp!G58=0,\"\",MužiZáp!G58)","v":""},{"$f":"IF(MužiZáp!H58=\"\",\"\",MužiZáp!H58)","v":""},{"$f":"IF(MužiZáp!I58=0,\"\",MužiZáp!I58)","v":""},{"$f":"MužiZáp!K58","v":"nie"}]
[null,"56.",{"$f":"IF(MužiZáp!C59=0,\"\",MužiZáp!C59)","v":""},{"$f":"IF(MužiZáp!D59=0,\"\",MužiZáp!D59)","v":""},{"$f":"IF(MužiZáp!E59=0,\"\",MužiZáp!E59)","v":""},{"$f":"IF(MužiZáp!F59=0,\"\",MužiZáp!F59)","v":""},{"$f":"IF(MužiZáp!G59=0,\"\",MužiZáp!G59)","v":""},{"$f":"IF(MužiZáp!H59=\"\",\"\",MužiZáp!H59)","v":""},{"$f":"IF(MužiZáp!I59=0,\"\",MužiZáp!I59)","v":""},{"$f":"MužiZáp!K59","v":"nie"}]
[null,"57.",{"$f":"IF(MužiZáp!C60=0,\"\",MužiZáp!C60)","v":""},{"$f":"IF(MužiZáp!D60=0,\"\",MužiZáp!D60)","v":""},{"$f":"IF(MužiZáp!E60=0,\"\",MužiZáp!E60)","v":""},{"$f":"IF(MužiZáp!F60=0,\"\",MužiZáp!F60)","v":""},{"$f":"IF(MužiZáp!G60=0,\"\",MužiZáp!G60)","v":""},{"$f":"IF(MužiZáp!H60=\"\",\"\",MužiZáp!H60)","v":""},{"$f":"IF(MužiZáp!I60=0,\"\",MužiZáp!I60)","v":""},{"$f":"MužiZáp!K60","v":"nie"}]
[null,"58.",{"$f":"IF(MužiZáp!C61=0,\"\",MužiZáp!C61)","v":""},{"$f":"IF(MužiZáp!D61=0,\"\",MužiZáp!D61)","v":""},{"$f":"IF(MužiZáp!E61=0,\"\",MužiZáp!E61)","v":""},{"$f":"IF(MužiZáp!F61=0,\"\",MužiZáp!F61)","v":""},{"$f":"IF(MužiZáp!G61=0,\"\",MužiZáp!G61)","v":""},{"$f":"IF(MužiZáp!H61=\"\",\"\",MužiZáp!H61)","v":""},{"$f":"IF(MužiZáp!I61=0,\"\",MužiZáp!I61)","v":""},{"$f":"MužiZáp!K61","v":"nie"}]
[null,"59.",{"$f":"IF(MužiZáp!C62=0,\"\",MužiZáp!C62)","v":""},{"$f":"IF(MužiZáp!D62=0,\"\",MužiZáp!D62)","v":""},{"$f":"IF(MužiZáp!E62=0,\"\",MužiZáp!E62)","v":""},{"$f":"IF(MužiZáp!F62=0,\"\",MužiZáp!F62)","v":""},{"$f":"IF(MužiZáp!G62=0,\"\",MužiZáp!G62)","v":""},{"$f":"IF(MužiZáp!H62=\"\",\"\",MužiZáp!H62)","v":""},{"$f":"IF(MužiZáp!I62=0,\"\",MužiZáp!I62)","v":""},{"$f":"MužiZáp!K62","v":"nie"}]
[null,"60.",{"$f":"IF(MužiZáp!C63=0,\"\",MužiZáp!C63)","v":""},{"$f":"IF(MužiZáp!D63=0,\"\",MužiZáp!D63)","v":""},{"$f":"IF(MužiZáp!E63=0,\"\",MužiZáp!E63)","v":""},{"$f":"IF(MužiZáp!F63=0,\"\",MužiZáp!F63)","v":""},{"$f":"IF(MužiZáp!G63=0,\"\",MužiZáp!G63)","v":""},{"$f":"IF(MužiZáp!H63=\"\",\"\",MužiZáp!H63)","v":""},{"$f":"IF(MužiZáp!I63=0,\"\",MužiZáp!I63)","v":""},{"$f":"MužiZáp!K63","v":"nie"}]
[null,"61.",{"$f":"IF(MužiZáp!C64=0,\"\",MužiZáp!C64)","v":""},{"$f":"IF(MužiZáp!D64=0,\"\",MužiZáp!D64)","v":""},{"$f":"IF(MužiZáp!E64=0,\"\",MužiZáp!E64)","v":""},{"$f":"IF(MužiZáp!F64=0,\"\",MužiZáp!F64)","v":""},{"$f":"IF(MužiZáp!G64=0,\"\",MužiZáp!G64)","v":""},{"$f":"IF(MužiZáp!H64=\"\",\"\",MužiZáp!H64)","v":""},{"$f":"IF(MužiZáp!I64=0,\"\",MužiZáp!I64)","v":""},{"$f":"MužiZáp!K64","v":"nie"}]
[null,"62.",{"$f":"IF(MužiZáp!C65=0,\"\",MužiZáp!C65)","v":""},{"$f":"IF(MužiZáp!D65=0,\"\",MužiZáp!D65)","v":""},{"$f":"IF(MužiZáp!E65=0,\"\",MužiZáp!E65)","v":""},{"$f":"IF(MužiZáp!F65=0,\"\",MužiZáp!F65)","v":""},{"$f":"IF(MužiZáp!G65=0,\"\",MužiZáp!G65)","v":""},{"$f":"IF(MužiZáp!H65=\"\",\"\",MužiZáp!H65)","v":""},{"$f":"IF(MužiZáp!I65=0,\"\",MužiZáp!I65)","v":""},{"$f":"MužiZáp!K65","v":"nie"}]
[null,"63.",{"$f":"IF(MužiZáp!C66=0,\"\",MužiZáp!C66)","v":""},{"$f":"IF(MužiZáp!D66=0,\"\",MužiZáp!D66)","v":""},{"$f":"IF(MužiZáp!E66=0,\"\",MužiZáp!E66)","v":""},{"$f":"IF(MužiZáp!F66=0,\"\",MužiZáp!F66)","v":""},{"$f":"IF(MužiZáp!G66=0,\"\",MužiZáp!G66)","v":""},{"$f":"IF(MužiZáp!H66=\"\",\"\",MužiZáp!H66)","v":""},{"$f":"IF(MužiZáp!I66=0,\"\",MužiZáp!I66)","v":""},{"$f":"MužiZáp!K66","v":"nie"}]
[null,"64.",{"$f":"IF(MužiZáp!C67=0,\"\",MužiZáp!C67)","v":""},{"$f":"IF(MužiZáp!D67=0,\"\",MužiZáp!D67)","v":""},{"$f":"IF(MužiZáp!E67=0,\"\",MužiZáp!E67)","v":""},{"$f":"IF(MužiZáp!F67=0,\"\",MužiZáp!F67)","v":""},{"$f":"IF(MužiZáp!G67=0,\"\",MužiZáp!G67)","v":""},{"$f":"IF(MužiZáp!H67=\"\",\"\",MužiZáp!H67)","v":""},{"$f":"IF(MužiZáp!I67=0,\"\",MužiZáp!I67)","v":""},{"$f":"MužiZáp!K67","v":"nie"}]
[null,"65.",{"$f":"IF(MužiZáp!C68=0,\"\",MužiZáp!C68)","v":""},{"$f":"IF(MužiZáp!D68=0,\"\",MužiZáp!D68)","v":""},{"$f":"IF(MužiZáp!E68=0,\"\",MužiZáp!E68)","v":""},{"$f":"IF(MužiZáp!F68=0,\"\",MužiZáp!F68)","v":""},{"$f":"IF(MužiZáp!G68=0,\"\",MužiZáp!G68)","v":""},{"$f":"IF(MužiZáp!H68=\"\",\"\",MužiZáp!H68)","v":""},{"$f":"IF(MužiZáp!I68=0,\"\",MužiZáp!I68)","v":""},{"$f":"MužiZáp!K68","v":"nie"}]
[null,"66.",{"$f":"IF(MužiZáp!C69=0,\"\",MužiZáp!C69)","v":""},{"$f":"IF(MužiZáp!D69=0,\"\",MužiZáp!D69)","v":""},{"$f":"IF(MužiZáp!E69=0,\"\",MužiZáp!E69)","v":""},{"$f":"IF(MužiZáp!F69=0,\"\",MužiZáp!F69)","v":""},{"$f":"IF(MužiZáp!G69=0,\"\",MužiZáp!G69)","v":""},{"$f":"IF(MužiZáp!H69=\"\",\"\",MužiZáp!H69)","v":""},{"$f":"IF(MužiZáp!I69=0,\"\",MužiZáp!I69)","v":""},{"$f":"MužiZáp!K69","v":"nie"}]
[null,"67.",{"$f":"IF(MužiZáp!C70=0,\"\",MužiZáp!C70)","v":""},{"$f":"IF(MužiZáp!D70=0,\"\",MužiZáp!D70)","v":""},{"$f":"IF(MužiZáp!E70=0,\"\",MužiZáp!E70)","v":""},{"$f":"IF(MužiZáp!F70=0,\"\",MužiZáp!F70)","v":""},{"$f":"IF(MužiZáp!G70=0,\"\",MužiZáp!G70)","v":""},{"$f":"IF(MužiZáp!H70=\"\",\"\",MužiZáp!H70)","v":""},{"$f":"IF(MužiZáp!I70=0,\"\",MužiZáp!I70)","v":""},{"$f":"MužiZáp!K70","v":"nie"}]
[null,"68.",{"$f":"IF(MužiZáp!C71=0,\"\",MužiZáp!C71)","v":""},{"$f":"IF(MužiZáp!D71=0,\"\",MužiZáp!D71)","v":""},{"$f":"IF(MužiZáp!E71=0,\"\",MužiZáp!E71)","v":""},{"$f":"IF(MužiZáp!F71=0,\"\",MužiZáp!F71)","v":""},{"$f":"IF(MužiZáp!G71=0,\"\",MužiZáp!G71)","v":""},{"$f":"IF(MužiZáp!H71=\"\",\"\",MužiZáp!H71)","v":""},{"$f":"IF(MužiZáp!I71=0,\"\",MužiZáp!I71)","v":""},{"$f":"MužiZáp!K71","v":"nie"}]
[null,"69.",{"$f":"IF(MužiZáp!C72=0,\"\",MužiZáp!C72)","v":""},{"$f":"IF(MužiZáp!D72=0,\"\",MužiZáp!D72)","v":""},{"$f":"IF(MužiZáp!E72=0,\"\",MužiZáp!E72)","v":""},{"$f":"IF(MužiZáp!F72=0,\"\",MužiZáp!F72)","v":""},{"$f":"IF(MužiZáp!G72=0,\"\",MužiZáp!G72)","v":""},{"$f":"IF(MužiZáp!H72=\"\",\"\",MužiZáp!H72)","v":""},{"$f":"IF(MužiZáp!I72=0,\"\",MužiZáp!I72)","v":""},{"$f":"MužiZáp!K72","v":"nie"}]
[null,"70.",{"$f":"IF(MužiZáp!C73=0,\"\",MužiZáp!C73)","v":""},{"$f":"IF(MužiZáp!D73=0,\"\",MužiZáp!D73)","v":""},{"$f":"IF(MužiZáp!E73=0,\"\",MužiZáp!E73)","v":""},{"$f":"IF(MužiZáp!F73=0,\"\",MužiZáp!F73)","v":""},{"$f":"IF(MužiZáp!G73=0,\"\",MužiZáp!G73)","v":""},{"$f":"IF(MužiZáp!H73=\"\",\"\",MužiZáp!H73)","v":""},{"$f":"IF(MužiZáp!I73=0,\"\",MužiZáp!I73)","v":""},{"$f":"MužiZáp!K73","v":"nie"}]
[null,"71.",{"$f":"IF(MužiZáp!C74=0,\"\",MužiZáp!C74)","v":""},{"$f":"IF(MužiZáp!D74=0,\"\",MužiZáp!D74)","v":""},{"$f":"IF(MužiZáp!E74=0,\"\",MužiZáp!E74)","v":""},{"$f":"IF(MužiZáp!F74=0,\"\",MužiZáp!F74)","v":""},{"$f":"IF(MužiZáp!G74=0,\"\",MužiZáp!G74)","v":""},{"$f":"IF(MužiZáp!H74=\"\",\"\",MužiZáp!H74)","v":""},{"$f":"IF(MužiZáp!I74=0,\"\",MužiZáp!I74)","v":""},{"$f":"MužiZáp!K74","v":"nie"}]
[null,"72.",{"$f":"IF(MužiZáp!C75=0,\"\",MužiZáp!C75)","v":""},{"$f":"IF(MužiZáp!D75=0,\"\",MužiZáp!D75)","v":""},{"$f":"IF(MužiZáp!E75=0,\"\",MužiZáp!E75)","v":""},{"$f":"IF(MužiZáp!F75=0,\"\",MužiZáp!F75)","v":""},{"$f":"IF(MužiZáp!G75=0,\"\",MužiZáp!G75)","v":""},{"$f":"IF(MužiZáp!H75=\"\",\"\",MužiZáp!H75)","v":""},{"$f":"IF(MužiZáp!I75=0,\"\",MužiZáp!I75)","v":""},{"$f":"MužiZáp!K75","v":"nie"}]
[]
[null,"Kraj :",null,{"$f":"ŽenyZáp!$F$1","v":"Trenčiansky"},null,null,{"$f":"ŽenyZáp!$H$2","v":"31.3.2019"}]
[null,"MK žien - 2019",null,null,"Kolkáreň :",{"$f":"ŽenyZáp!$E$2","v":"Trenčín"}]
[]
[null,"Por.","Hráči","Č.r.p.","Klub","Plné","Dorážka","Chyby","Spolu"]
[]
[null,"1.",{"$f":"IF(ŽenyZáp!C11=0,\"\",ŽenyZáp!C11)","v":""},{"$f":"IF(ŽenyZáp!D11=0,\"\",ŽenyZáp!D11)","v":""},{"$f":"IF(ŽenyZáp!E11=0,\"\",ŽenyZáp!E11)","v":""},{"$f":"IF(ŽenyZáp!F11=0,\"\",ŽenyZáp!F11)","v":""},{"$f":"IF(ŽenyZáp!G11=0,\"\",ŽenyZáp!G11)","v":""},{"$f":"IF(ŽenyZáp!H11=\"\",\"\",ŽenyZáp!H11)","v":""},{"$f":"IF(ŽenyZáp!I11=0,\"\",ŽenyZáp!I11)","v":""},{"$f":"ŽenyZáp!K11","v":"nie"}]
[null,"2.",{"$f":"IF(ŽenyZáp!C4=0,\"\",ŽenyZáp!C4)","v":"Búliková Erika"},{"$f":"IF(ŽenyZáp!D4=0,\"\",ŽenyZáp!D4)","v":7955},{"$f":"IF(ŽenyZáp!E4=0,\"\",ŽenyZáp!E4)","v":"TKK Trenčín"},{"$f":"IF(ŽenyZáp!F4=0,\"\",ŽenyZáp!F4)","v":345},{"$f":"IF(ŽenyZáp!G4=0,\"\",ŽenyZáp!G4)","v":154},{"$f":"IF(ŽenyZáp!H4=\"\",\"\",ŽenyZáp!H4)","v":11},{"$f":"IF(ŽenyZáp!I4=0,\"\",ŽenyZáp!I4)","v":499},{"$f":"ŽenyZáp!K4","v":"áno"}]
[null,"3.",{"$f":"IF(ŽenyZáp!C5=0,\"\",ŽenyZáp!C5)","v":"Gordíková Lenka"},{"$f":"IF(ŽenyZáp!D5=0,\"\",ŽenyZáp!D5)","v":919},{"$f":"IF(ŽenyZáp!E5=0,\"\",ŽenyZáp!E5)","v":"MKK Stará Turá"},{"$f":"IF(ŽenyZáp!F5=0,\"\",ŽenyZáp!F5)","v":352},{"$f":"IF(ŽenyZáp!G5=0,\"\",ŽenyZáp!G5)","v":201},{"$f":"IF(ŽenyZáp!H5=\"\",\"\",ŽenyZáp!H5)","v":2},{"$f":"IF(ŽenyZáp!I5=0,\"\",ŽenyZáp!I5)","v":553},{"$f":"ŽenyZáp!K5","v":"áno"}]
[null,"4.",{"$f":"IF(ŽenyZáp!C6=0,\"\",ŽenyZáp!C6)","v":"Radošová Eva"},{"$f":"IF(ŽenyZáp!D6=0,\"\",ŽenyZáp!D6)","v":963},{"$f":"IF(ŽenyZáp!E6=0,\"\",ŽenyZáp!E6)","v":"KK Moravské Lieskové"},{"$f":"IF(ŽenyZáp!F6=0,\"\",ŽenyZáp!F6)","v":328},{"$f":"IF(ŽenyZáp!G6=0,\"\",ŽenyZáp!G6)","v":137},{"$f":"IF(ŽenyZáp!H6=\"\",\"\",ŽenyZáp!H6)","v":15},{"$f":"IF(ŽenyZáp!I6=0,\"\",ŽenyZáp!I6)","v":465},{"$f":"ŽenyZáp!K6","v":"áno"}]
[null,"5.",{"$f":"IF(ŽenyZáp!C7=0,\"\",ŽenyZáp!C7)","v":""},{"$f":"IF(ŽenyZáp!D7=0,\"\",ŽenyZáp!D7)","v":""},{"$f":"IF(ŽenyZáp!E7=0,\"\",ŽenyZáp!E7)","v":""},{"$f":"IF(ŽenyZáp!F7=0,\"\",ŽenyZáp!F7)","v":""},{"$f":"IF(ŽenyZáp!G7=0,\"\",ŽenyZáp!G7)","v":""},{"$f":"IF(ŽenyZáp!H7=\"\",\"\",ŽenyZáp!H7)","v":""},{"$f":"IF(ŽenyZáp!I7=0,\"\",ŽenyZáp!I7)","v":""},{"$f":"ŽenyZáp!K7","v":"nie"}]
[null,"6.",{"$f":"IF(ŽenyZáp!C8=0,\"\",ŽenyZáp!C8)","v":""},{"$f":"IF(ŽenyZáp!D8=0,\"\",ŽenyZáp!D8)","v":""},{"$f":"IF(ŽenyZáp!E8=0,\"\",ŽenyZáp!E8)","v":""},{"$f":"IF(ŽenyZáp!F8=0,\"\",ŽenyZáp!F8)","v":""},{"$f":"IF(ŽenyZáp!G8=0,\"\",ŽenyZáp!G8)","v":""},{"$f":"IF(ŽenyZáp!H8=\"\",\"\",ŽenyZáp!H8)","v":""},{"$f":"IF(ŽenyZáp!I8=0,\"\",ŽenyZáp!I8)","v":""},{"$f":"ŽenyZáp!K8","v":"nie"}]
[null,"7.",{"$f":"IF(ŽenyZáp!C9=0,\"\",ŽenyZáp!C9)","v":""},{"$f":"IF(ŽenyZáp!D9=0,\"\",ŽenyZáp!D9)","v":""},{"$f":"IF(ŽenyZáp!E9=0,\"\",ŽenyZáp!E9)","v":""},{"$f":"IF(ŽenyZáp!F9=0,\"\",ŽenyZáp!F9)","v":""},{"$f":"IF(ŽenyZáp!G9=0,\"\",ŽenyZáp!G9)","v":""},{"$f":"IF(ŽenyZáp!H9=\"\",\"\",ŽenyZáp!H9)","v":""},{"$f":"IF(ŽenyZáp!I9=0,\"\",ŽenyZáp!I9)","v":""},{"$f":"ŽenyZáp!K9","v":"nie"}]
[null,"8.",{"$f":"IF(ŽenyZáp!C10=0,\"\",ŽenyZáp!C10)","v":""},{"$f":"IF(ŽenyZáp!D10=0,\"\",ŽenyZáp!D10)","v":""},{"$f":"IF(ŽenyZáp!E10=0,\"\",ŽenyZáp!E10)","v":""},{"$f":"IF(ŽenyZáp!F10=0,\"\",ŽenyZáp!F10)","v":""},{"$f":"IF(ŽenyZáp!G10=0,\"\",ŽenyZáp!G10)","v":""},{"$f":"IF(ŽenyZáp!H10=\"\",\"\",ŽenyZáp!H10)","v":""},{"$f":"IF(ŽenyZáp!I10=0,\"\",ŽenyZáp!I10)","v":""},{"$f":"ŽenyZáp!K10","v":"nie"}]
[null,"9.",{"$f":"IF(ŽenyZáp!C12=0,\"\",ŽenyZáp!C12)","v":""},{"$f":"IF(ŽenyZáp!D12=0,\"\",ŽenyZáp!D12)","v":""},{"$f":"IF(ŽenyZáp!E12=0,\"\",ŽenyZáp!E12)","v":""},{"$f":"IF(ŽenyZáp!F12=0,\"\",ŽenyZáp!F12)","v":""},{"$f":"IF(ŽenyZáp!G12=0,\"\",ŽenyZáp!G12)","v":""},{"$f":"IF(ŽenyZáp!H12=\"\",\"\",ŽenyZáp!H12)","v":""},{"$f":"IF(ŽenyZáp!I12=0,\"\",ŽenyZáp!I12)","v":""},{"$f":"ŽenyZáp!K12","v":"nie"}]
[null,"10.",{"$f":"IF(ŽenyZáp!C13=0,\"\",ŽenyZáp!C13)","v":""},{"$f":"IF(ŽenyZáp!D13=0,\"\",ŽenyZáp!D13)","v":""},{"$f":"IF(ŽenyZáp!E13=0,\"\",ŽenyZáp!E13)","v":""},{"$f":"IF(ŽenyZáp!F13=0,\"\",ŽenyZáp!F13)","v":""},{"$f":"IF(ŽenyZáp!G13=0,\"\",ŽenyZáp!G13)","v":""},{"$f":"IF(ŽenyZáp!H13=\"\",\"\",ŽenyZáp!H13)","v":""},{"$f":"IF(ŽenyZáp!I13=0,\"\",ŽenyZáp!I13)","v":""},{"$f":"ŽenyZáp!K13","v":"nie"}]
[null,"11.",{"$f":"IF(ŽenyZáp!C14=0,\"\",ŽenyZáp!C14)","v":""},{"$f":"IF(ŽenyZáp!D14=0,\"\",ŽenyZáp!D14)","v":""},{"$f":"IF(ŽenyZáp!E14=0,\"\",ŽenyZáp!E14)","v":""},{"$f":"IF(ŽenyZáp!F14=0,\"\",ŽenyZáp!F14)","v":""},{"$f":"IF(ŽenyZáp!G14=0,\"\",ŽenyZáp!G14)","v":""},{"$f":"IF(ŽenyZáp!H14=\"\",\"\",ŽenyZáp!H14)","v":""},{"$f":"IF(ŽenyZáp!I14=0,\"\",ŽenyZáp!I14)","v":""},{"$f":"ŽenyZáp!K14","v":"nie"}]
[null,"12.",{"$f":"IF(ŽenyZáp!C15=0,\"\",ŽenyZáp!C15)","v":""},{"$f":"IF(ŽenyZáp!D15=0,\"\",ŽenyZáp!D15)","v":""},{"$f":"IF(ŽenyZáp!E15=0,\"\",ŽenyZáp!E15)","v":""},{"$f":"IF(ŽenyZáp!F15=0,\"\",ŽenyZáp!F15)","v":""},{"$f":"IF(ŽenyZáp!G15=0,\"\",ŽenyZáp!G15)","v":""},{"$f":"IF(ŽenyZáp!H15=\"\",\"\",ŽenyZáp!H15)","v":""},{"$f":"IF(ŽenyZáp!I15=0,\"\",ŽenyZáp!I15)","v":""},{"$f":"ŽenyZáp!K15","v":"nie"}]
[null,"13.",{"$f":"IF(ŽenyZáp!C16=0,\"\",ŽenyZáp!C16)","v":""},{"$f":"IF(ŽenyZáp!D16=0,\"\",ŽenyZáp!D16)","v":""},{"$f":"IF(ŽenyZáp!E16=0,\"\",ŽenyZáp!E16)","v":""},{"$f":"IF(ŽenyZáp!F16=0,\"\",ŽenyZáp!F16)","v":""},{"$f":"IF(ŽenyZáp!G16=0,\"\",ŽenyZáp!G16)","v":""},{"$f":"IF(ŽenyZáp!H16=\"\",\"\",ŽenyZáp!H16)","v":""},{"$f":"IF(ŽenyZáp!I16=0,\"\",ŽenyZáp!I16)","v":""},{"$f":"ŽenyZáp!K16","v":"nie"}]
[null,"14.",{"$f":"IF(ŽenyZáp!C17=0,\"\",ŽenyZáp!C17)","v":""},{"$f":"IF(ŽenyZáp!D17=0,\"\",ŽenyZáp!D17)","v":""},{"$f":"IF(ŽenyZáp!E17=0,\"\",ŽenyZáp!E17)","v":""},{"$f":"IF(ŽenyZáp!F17=0,\"\",ŽenyZáp!F17)","v":""},{"$f":"IF(ŽenyZáp!G17=0,\"\",ŽenyZáp!G17)","v":""},{"$f":"IF(ŽenyZáp!H17=\"\",\"\",ŽenyZáp!H17)","v":""},{"$f":"IF(ŽenyZáp!I17=0,\"\",ŽenyZáp!I17)","v":""},{"$f":"ŽenyZáp!K17","v":"nie"}]
[null,"15.",{"$f":"IF(ŽenyZáp!C18=0,\"\",ŽenyZáp!C18)","v":""},{"$f":"IF(ŽenyZáp!D18=0,\"\",ŽenyZáp!D18)","v":""},{"$f":"IF(ŽenyZáp!E18=0,\"\",ŽenyZáp!E18)","v":""},{"$f":"IF(ŽenyZáp!F18=0,\"\",ŽenyZáp!F18)","v":""},{"$f":"IF(ŽenyZáp!G18=0,\"\",ŽenyZáp!G18)","v":""},{"$f":"IF(ŽenyZáp!H18=\"\",\"\",ŽenyZáp!H18)","v":""},{"$f":"IF(ŽenyZáp!I18=0,\"\",ŽenyZáp!I18)","v":""},{"$f":"ŽenyZáp!K18","v":"nie"}]
[null,"16.",{"$f":"IF(ŽenyZáp!C19=0,\"\",ŽenyZáp!C19)","v":""},{"$f":"IF(ŽenyZáp!D19=0,\"\",ŽenyZáp!D19)","v":""},{"$f":"IF(ŽenyZáp!E19=0,\"\",ŽenyZáp!E19)","v":""},{"$f":"IF(ŽenyZáp!F19=0,\"\",ŽenyZáp!F19)","v":""},{"$f":"IF(ŽenyZáp!G19=0,\"\",ŽenyZáp!G19)","v":""},{"$f":"IF(ŽenyZáp!H19=\"\",\"\",ŽenyZáp!H19)","v":""},{"$f":"IF(ŽenyZáp!I19=0,\"\",ŽenyZáp!I19)","v":""},{"$f":"ŽenyZáp!K19","v":"nie"}]
[null,"17.",{"$f":"IF(ŽenyZáp!C20=0,\"\",ŽenyZáp!C20)","v":""},{"$f":"IF(ŽenyZáp!D20=0,\"\",ŽenyZáp!D20)","v":""},{"$f":"IF(ŽenyZáp!E20=0,\"\",ŽenyZáp!E20)","v":""},{"$f":"IF(ŽenyZáp!F20=0,\"\",ŽenyZáp!F20)","v":""},{"$f":"IF(ŽenyZáp!G20=0,\"\",ŽenyZáp!G20)","v":""},{"$f":"IF(ŽenyZáp!H20=\"\",\"\",ŽenyZáp!H20)","v":""},{"$f":"IF(ŽenyZáp!I20=0,\"\",ŽenyZáp!I20)","v":""},{"$f":"ŽenyZáp!K20","v":"nie"}]
[null,"18.",{"$f":"IF(ŽenyZáp!C21=0,\"\",ŽenyZáp!C21)","v":""},{"$f":"IF(ŽenyZáp!D21=0,\"\",ŽenyZáp!D21)","v":""},{"$f":"IF(ŽenyZáp!E21=0,\"\",ŽenyZáp!E21)","v":""},{"$f":"IF(ŽenyZáp!F21=0,\"\",ŽenyZáp!F21)","v":""},{"$f":"IF(ŽenyZáp!G21=0,\"\",ŽenyZáp!G21)","v":""},{"$f":"IF(ŽenyZáp!H21=\"\",\"\",ŽenyZáp!H21)","v":""},{"$f":"IF(ŽenyZáp!I21=0,\"\",ŽenyZáp!I21)","v":""},{"$f":"ŽenyZáp!K21","v":"nie"}]
[null,"19.",{"$f":"IF(ŽenyZáp!C22=0,\"\",ŽenyZáp!C22)","v":""},{"$f":"IF(ŽenyZáp!D22=0,\"\",ŽenyZáp!D22)","v":""},{"$f":"IF(ŽenyZáp!E22=0,\"\",ŽenyZáp!E22)","v":""},{"$f":"IF(ŽenyZáp!F22=0,\"\",ŽenyZáp!F22)","v":""},{"$f":"IF(ŽenyZáp!G22=0,\"\",ŽenyZáp!G22)","v":""},{"$f":"IF(ŽenyZáp!H22=\"\",\"\",ŽenyZáp!H22)","v":""},{"$f":"IF(ŽenyZáp!I22=0,\"\",ŽenyZáp!I22)","v":""},{"$f":"ŽenyZáp!K22","v":"nie"}]
[null,"20.",{"$f":"IF(ŽenyZáp!C23=0,\"\",ŽenyZáp!C23)","v":""},{"$f":"IF(ŽenyZáp!D23=0,\"\",ŽenyZáp!D23)","v":""},{"$f":"IF(ŽenyZáp!E23=0,\"\",ŽenyZáp!E23)","v":""},{"$f":"IF(ŽenyZáp!F23=0,\"\",ŽenyZáp!F23)","v":""},{"$f":"IF(ŽenyZáp!G23=0,\"\",ŽenyZáp!G23)","v":""},{"$f":"IF(ŽenyZáp!H23=\"\",\"\",ŽenyZáp!H23)","v":""},{"$f":"IF(ŽenyZáp!I23=0,\"\",ŽenyZáp!I23)","v":""},{"$f":"ŽenyZáp!K23","v":"nie"}]
[null,"21.",{"$f":"IF(ŽenyZáp!C24=0,\"\",ŽenyZáp!C24)","v":""},{"$f":"IF(ŽenyZáp!D24=0,\"\",ŽenyZáp!D24)","v":""},{"$f":"IF(ŽenyZáp!E24=0,\"\",ŽenyZáp!E24)","v":""},{"$f":"IF(ŽenyZáp!F24=0,\"\",ŽenyZáp!F24)","v":""},{"$f":"IF(ŽenyZáp!G24=0,\"\",ŽenyZáp!G24)","v":""},{"$f":"IF(ŽenyZáp!H24=\"\",\"\",ŽenyZáp!H24)","v":""},{"$f":"IF(ŽenyZáp!I24=0,\"\",ŽenyZáp!I24)","v":""},{"$f":"ŽenyZáp!K24","v":"nie"}]
[null,"22.",{"$f":"IF(ŽenyZáp!C25=0,\"\",ŽenyZáp!C25)","v":""},{"$f":"IF(ŽenyZáp!D25=0,\"\",ŽenyZáp!D25)","v":""},{"$f":"IF(ŽenyZáp!E25=0,\"\",ŽenyZáp!E25)","v":""},{"$f":"IF(ŽenyZáp!F25=0,\"\",ŽenyZáp!F25)","v":""},{"$f":"IF(ŽenyZáp!G25=0,\"\",ŽenyZáp!G25)","v":""},{"$f":"IF(ŽenyZáp!H25=\"\",\"\",ŽenyZáp!H25)","v":""},{"$f":"IF(ŽenyZáp!I25=0,\"\",ŽenyZáp!I25)","v":""},{"$f":"ŽenyZáp!K25","v":"nie"}]
[null,"23.",{"$f":"IF(ŽenyZáp!C26=0,\"\",ŽenyZáp!C26)","v":""},{"$f":"IF(ŽenyZáp!D26=0,\"\",ŽenyZáp!D26)","v":""},{"$f":"IF(ŽenyZáp!E26=0,\"\",ŽenyZáp!E26)","v":""},{"$f":"IF(ŽenyZáp!F26=0,\"\",ŽenyZáp!F26)","v":""},{"$f":"IF(ŽenyZáp!G26=0,\"\",ŽenyZáp!G26)","v":""},{"$f":"IF(ŽenyZáp!H26=\"\",\"\",ŽenyZáp!H26)","v":""},{"$f":"IF(ŽenyZáp!I26=0,\"\",ŽenyZáp!I26)","v":""},{"$f":"ŽenyZáp!K26","v":"nie"}]
[null,"24.",{"$f":"IF(ŽenyZáp!C27=0,\"\",ŽenyZáp!C27)","v":""},{"$f":"IF(ŽenyZáp!D27=0,\"\",ŽenyZáp!D27)","v":""},{"$f":"IF(ŽenyZáp!E27=0,\"\",ŽenyZáp!E27)","v":""},{"$f":"IF(ŽenyZáp!F27=0,\"\",ŽenyZáp!F27)","v":""},{"$f":"IF(ŽenyZáp!G27=0,\"\",ŽenyZáp!G27)","v":""},{"$f":"IF(ŽenyZáp!H27=\"\",\"\",ŽenyZáp!H27)","v":""},{"$f":"IF(ŽenyZáp!I27=0,\"\",ŽenyZáp!I27)","v":""},{"$f":"ŽenyZáp!K27","v":"nie"}]
[null,"25.",{"$f":"IF(ŽenyZáp!C28=0,\"\",ŽenyZáp!C28)","v":""},{"$f":"IF(ŽenyZáp!D28=0,\"\",ŽenyZáp!D28)","v":""},{"$f":"IF(ŽenyZáp!E28=0,\"\",ŽenyZáp!E28)","v":""},{"$f":"IF(ŽenyZáp!F28=0,\"\",ŽenyZáp!F28)","v":""},{"$f":"IF(ŽenyZáp!G28=0,\"\",ŽenyZáp!G28)","v":""},{"$f":"IF(ŽenyZáp!H28=\"\",\"\",ŽenyZáp!H28)","v":""},{"$f":"IF(ŽenyZáp!I28=0,\"\",ŽenyZáp!I28)","v":""},{"$f":"ŽenyZáp!K28","v":"nie"}]
[null,"26.",{"$f":"IF(ŽenyZáp!C29=0,\"\",ŽenyZáp!C29)","v":""},{"$f":"IF(ŽenyZáp!D29=0,\"\",ŽenyZáp!D29)","v":""},{"$f":"IF(ŽenyZáp!E29=0,\"\",ŽenyZáp!E29)","v":""},{"$f":"IF(ŽenyZáp!F29=0,\"\",ŽenyZáp!F29)","v":""},{"$f":"IF(ŽenyZáp!G29=0,\"\",ŽenyZáp!G29)","v":""},{"$f":"IF(ŽenyZáp!H29=\"\",\"\",ŽenyZáp!H29)","v":""},{"$f":"IF(ŽenyZáp!I29=0,\"\",ŽenyZáp!I29)","v":""},{"$f":"ŽenyZáp!K29","v":"nie"}]
[null,"27.",{"$f":"IF(ŽenyZáp!C30=0,\"\",ŽenyZáp!C30)","v":""},{"$f":"IF(ŽenyZáp!D30=0,\"\",ŽenyZáp!D30)","v":""},{"$f":"IF(ŽenyZáp!E30=0,\"\",ŽenyZáp!E30)","v":""},{"$f":"IF(ŽenyZáp!F30=0,\"\",ŽenyZáp!F30)","v":""},{"$f":"IF(ŽenyZáp!G30=0,\"\",ŽenyZáp!G30)","v":""},{"$f":"IF(ŽenyZáp!H30=\"\",\"\",ŽenyZáp!H30)","v":""},{"$f":"IF(ŽenyZáp!I30=0,\"\",ŽenyZáp!I30)","v":""},{"$f":"ŽenyZáp!K30","v":"nie"}]
[null,"28.",{"$f":"IF(ŽenyZáp!C31=0,\"\",ŽenyZáp!C31)","v":""},{"$f":"IF(ŽenyZáp!D31=0,\"\",ŽenyZáp!D31)","v":""},{"$f":"IF(ŽenyZáp!E31=0,\"\",ŽenyZáp!E31)","v":""},{"$f":"IF(ŽenyZáp!F31=0,\"\",ŽenyZáp!F31)","v":""},{"$f":"IF(ŽenyZáp!G31=0,\"\",ŽenyZáp!G31)","v":""},{"$f":"IF(ŽenyZáp!H31=\"\",\"\",ŽenyZáp!H31)","v":""},{"$f":"IF(ŽenyZáp!I31=0,\"\",ŽenyZáp!I31)","v":""},{"$f":"ŽenyZáp!K31","v":"nie"}]
[null,"29.",{"$f":"IF(ŽenyZáp!C32=0,\"\",ŽenyZáp!C32)","v":""},{"$f":"IF(ŽenyZáp!D32=0,\"\",ŽenyZáp!D32)","v":""},{"$f":"IF(ŽenyZáp!E32=0,\"\",ŽenyZáp!E32)","v":""},{"$f":"IF(ŽenyZáp!F32=0,\"\",ŽenyZáp!F32)","v":""},{"$f":"IF(ŽenyZáp!G32=0,\"\",ŽenyZáp!G32)","v":""},{"$f":"IF(ŽenyZáp!H32=\"\",\"\",ŽenyZáp!H32)","v":""},{"$f":"IF(ŽenyZáp!I32=0,\"\",ŽenyZáp!I32)","v":""},{"$f":"ŽenyZáp!K32","v":"nie"}]
[null,"30.",{"$f":"IF(ŽenyZáp!C33=0,\"\",ŽenyZáp!C33)","v":""},{"$f":"IF(ŽenyZáp!D33=0,\"\",ŽenyZáp!D33)","v":""},{"$f":"IF(ŽenyZáp!E33=0,\"\",ŽenyZáp!E33)","v":""},{"$f":"IF(ŽenyZáp!F33=0,\"\",ŽenyZáp!F33)","v":""},{"$f":"IF(ŽenyZáp!G33=0,\"\",ŽenyZáp!G33)","v":""},{"$f":"IF(ŽenyZáp!H33=\"\",\"\",ŽenyZáp!H33)","v":""},{"$f":"IF(ŽenyZáp!I33=0,\"\",ŽenyZáp!I33)","v":""},{"$f":"ŽenyZáp!K33","v":"nie"}]
[]
[null,"Kraj :",null,{"$f":"SenioriU_50Záp!$F$1","v":"Trenčiansky"},null,null,{"$f":"SenioriU_50Záp!$H$2","v":"3.2.2019"}]
[null,"MK seniorov U-50 2019",null,null,"Kolkáreň :",{"$f":"SenioriU_50Záp!$E$2","v":"Trenčín"}]
[]
[null,"Por.","Hráči","Č.r.p.","Klub","Plné","Dorážka","Chyby","Spolu"]
[]
[null,"1.",{"$f":"IF(SenioriU_50Záp!C4=0,\"\",SenioriU_50Záp!C4)","v":"Bača Ján"},{"$f":"IF(SenioriU_50Záp!D4=0,\"\",SenioriU_50Záp!D4)","v":1088},{"$f":"IF(SenioriU_50Záp!E4=0,\"\",SenioriU_50Záp!E4)","v":"KK Moravské Lieskové"},{"$f":"IF(SenioriU_50Záp!F4=0,\"\",SenioriU_50Záp!F4)","v":352},{"$f":"IF(SenioriU_50Záp!G4=0,\"\",SenioriU_50Záp!G4)","v":156},{"$f":"IF(SenioriU_50Záp!H4=\"\",\"\",SenioriU_50Záp!H4)","v":9},{"$f":"IF(SenioriU_50Záp!I4=0,\"\",SenioriU_50Záp!I4)","v":508},{"$f":"SenioriU_50Záp!K4","v":"áno"}]
[null,"2.",{"$f":"IF(SenioriU_50Záp!C5=0,\"\",SenioriU_50Záp!C5)","v":"Malíček Dušan"},{"$f":"IF(SenioriU_50Záp!D5=0,\"\",SenioriU_50Záp!D5)","v":8137},{"$f":"IF(SenioriU_50Záp!E5=0,\"\",SenioriU_50Záp!E5)","v":"KK Moravské Lieskové"},{"$f":"IF(SenioriU_50Záp!F5=0,\"\",SenioriU_50Záp!F5)","v":367},{"$f":"IF(SenioriU_50Záp!G5=0,\"\",SenioriU_50Záp!G5)","v":142},{"$f":"IF(SenioriU_50Záp!H5=\"\",\"\",SenioriU_50Záp!H5)","v":12},{"$f":"IF(SenioriU_50Záp!I5=0,\"\",SenioriU_50Záp!I5)","v":509},{"$f":"SenioriU_50Záp!K5","v":"áno"}]
[null,"3.",{"$f":"IF(SenioriU_50Záp!C6=0,\"\",SenioriU_50Záp!C6)","v":"Adamkovič Marian"},{"$f":"IF(SenioriU_50Záp!D6=0,\"\",SenioriU_50Záp!D6)","v":""},{"$f":"IF(SenioriU_50Záp!E6=0,\"\",SenioriU_50Záp!E6)","v":"KK Uhrovec"},{"$f":"IF(SenioriU_50Záp!F6=0,\"\",SenioriU_50Záp!F6)","v":324},{"$f":"IF(SenioriU_50Záp!G6=0,\"\",SenioriU_50Záp!G6)","v":139},{"$f":"IF(SenioriU_50Záp!H6=\"\",\"\",SenioriU_50Záp!H6)","v":14},{"$f":"IF(SenioriU_50Záp!I6=0,\"\",SenioriU_50Záp!I6)","v":463},{"$f":"SenioriU_50Záp!K6","v":"áno"}]
[null,"4.",{"$f":"IF(SenioriU_50Záp!C7=0,\"\",SenioriU_50Záp!C7)","v":"Búlik Jozef"},{"$f":"IF(SenioriU_50Záp!D7=0,\"\",SenioriU_50Záp!D7)","v":7954},{"$f":"IF(SenioriU_50Záp!E7=0,\"\",SenioriU_50Záp!E7)","v":"TKK Trenčín"},{"$f":"IF(SenioriU_50Záp!F7=0,\"\",SenioriU_50Záp!F7)","v":359},{"$f":"IF(SenioriU_50Záp!G7=0,\"\",SenioriU_50Záp!G7)","v":160},{"$f":"IF(SenioriU_50Záp!H7=\"\",\"\",SenioriU_50Záp!H7)","v":5},{"$f":"IF(SenioriU_50Záp!I7=0,\"\",SenioriU_50Záp!I7)","v":519},{"$f":"SenioriU_50Záp!K7","v":"áno"}]
[null,"5.",{"$f":"IF(SenioriU_50Záp!C8=0,\"\",SenioriU_50Záp!C8)","v":"Minárik Anton"},{"$f":"IF(SenioriU_50Záp!D8=0,\"\",SenioriU_50Záp!D8)","v":8049},{"$f":"IF(SenioriU_50Záp!E8=0,\"\",SenioriU_50Záp!E8)","v":"KK Dubnica"},{"$f":"IF(SenioriU_50Záp!F8=0,\"\",SenioriU_50Záp!F8)","v":353},{"$f":"IF(SenioriU_50Záp!G8=0,\"\",SenioriU_50Záp!G8)","v":152},{"$f":"IF(SenioriU_50Záp!H8=\"\",\"\",SenioriU_50Záp!H8)","v":11},{"$f":"IF(SenioriU_50Záp!I8=0,\"\",SenioriU_50Záp!I8)","v":505},{"$f":"SenioriU_50Záp!K8","v":"áno"}]
[null,"6.",{"$f":"IF(SenioriU_50Záp!C9=0,\"\",SenioriU_50Záp!C9)","v":"Moško Ivan"},{"$f":"IF(SenioriU_50Záp!D9=0,\"\",SenioriU_50Záp!D9)","v":7981},{"$f":"IF(SenioriU_50Záp!E9=0,\"\",SenioriU_50Záp!E9)","v":"KK Dubnica"},{"$f":"IF(SenioriU_50Záp!F9=0,\"\",SenioriU_50Záp!F9)","v":348},{"$f":"IF(SenioriU_50Záp!G9=0,\"\",SenioriU_50Záp!G9)","v":141},{"$f":"IF(SenioriU_50Záp!H9=\"\",\"\",SenioriU_50Záp!H9)","v":13},{"$f":"IF(SenioriU_50Záp!I9=0,\"\",SenioriU_50Záp!I9)","v":489},{"$f":"SenioriU_50Záp!K9","v":"áno"}]
[null,"7.",{"$f":"IF(SenioriU_50Záp!C10=0,\"\",SenioriU_50Záp!C10)","v":"Strempek Milan"},{"$f":"IF(SenioriU_50Záp!D10=0,\"\",SenioriU_50Záp!D10)","v":860},{"$f":"IF(SenioriU_50Záp!E10=0,\"\",SenioriU_50Záp!E10)","v":"KK Uhrovec"},{"$f":"IF(SenioriU_50Záp!F10=0,\"\",SenioriU_50Záp!F10)","v":311},{"$f":"IF(SenioriU_50Záp!G10=0,\"\",SenioriU_50Záp!G10)","v":148},{"$f":"IF(SenioriU_50Záp!H10=\"\",\"\",SenioriU_50Záp!H10)","v":11},{"$f":"IF(SenioriU_50Záp!I10=0,\"\",SenioriU_50Záp!I10)","v":459},{"$f":"SenioriU_50Záp!K10","v":"áno"}]
[null,"8.",{"$f":"IF(SenioriU_50Záp!C11=0,\"\",SenioriU_50Záp!C11)","v":"Vavrinec Jozef"},{"$f":"IF(SenioriU_50Záp!D11=0,\"\",SenioriU_50Záp!D11)","v":7764},{"$f":"IF(SenioriU_50Záp!E11=0,\"\",SenioriU_50Záp!E11)","v":"TKK Trenčín"},{"$f":"IF(SenioriU_50Záp!F11=0,\"\",SenioriU_50Záp!F11)","v":361},{"$f":"IF(SenioriU_50Záp!G11=0,\"\",SenioriU_50Záp!G11)","v":187},{"$f":"IF(SenioriU_50Záp!H11=\"\",\"\",SenioriU_50Záp!H11)","v":5},{"$f":"IF(SenioriU_50Záp!I11=0,\"\",SenioriU_50Záp!I11)","v":548},{"$f":"SenioriU_50Záp!K11","v":"áno"}]
[null,"9.",{"$f":"IF(SenioriU_50Záp!C12=0,\"\",SenioriU_50Záp!C12)","v":"Truska Milan"},{"$f":"IF(SenioriU_50Záp!D12=0,\"\",SenioriU_50Záp!D12)","v":7967},{"$f":"IF(SenioriU_50Záp!E12=0,\"\",SenioriU_50Záp!E12)","v":"TKK Trenčín"},{"$f":"IF(SenioriU_50Záp!F12=0,\"\",SenioriU_50Záp!F12)","v":369},{"$f":"IF(SenioriU_50Záp!G12=0,\"\",SenioriU_50Záp!G12)","v":164},{"$f":"IF(SenioriU_50Záp!H12=\"\",\"\",SenioriU_50Záp!H12)","v":5},{"$f":"IF(SenioriU_50Záp!I12=0,\"\",SenioriU_50Záp!I12)","v":533},{"$f":"SenioriU_50Záp!K12","v":"áno"}]
[null,"10.",{"$f":"IF(SenioriU_50Záp!C13=0,\"\",SenioriU_50Záp!C13)","v":"Okša Milan"},{"$f":"IF(SenioriU_50Záp!D13=0,\"\",SenioriU_50Záp!D13)","v":587},{"$f":"IF(SenioriU_50Záp!E13=0,\"\",SenioriU_50Záp!E13)","v":"KK Uhrovec"},{"$f":"IF(SenioriU_50Záp!F13=0,\"\",SenioriU_50Záp!F13)","v":284},{"$f":"IF(SenioriU_50Záp!G13=0,\"\",SenioriU_50Záp!G13)","v":84},{"$f":"IF(SenioriU_50Záp!H13=\"\",\"\",SenioriU_50Záp!H13)","v":24},{"$f":"IF(SenioriU_50Záp!I13=0,\"\",SenioriU_50Záp!I13)","v":368},{"$f":"SenioriU_50Záp!K13","v":"áno"}]
[null,"11.",{"$f":"IF(SenioriU_50Záp!C14=0,\"\",SenioriU_50Záp!C14)","v":"Petreje Pavol"},{"$f":"IF(SenioriU_50Záp!D14=0,\"\",SenioriU_50Záp!D14)","v":374},{"$f":"IF(SenioriU_50Záp!E14=0,\"\",SenioriU_50Záp!E14)","v":"KK Uhrovec"},{"$f":"IF(SenioriU_50Záp!F14=0,\"\",SenioriU_50Záp!F14)","v":349},{"$f":"IF(SenioriU_50Záp!G14=0,\"\",SenioriU_50Záp!G14)","v":175},{"$f":"IF(SenioriU_50Záp!H14=\"\",\"\",SenioriU_50Záp!H14)","v":8},{"$f":"IF(SenioriU_50Záp!I14=0,\"\",SenioriU_50Záp!I14)","v":524},{"$f":"SenioriU_50Záp!K14","v":"áno"}]
[null,"12.",{"$f":"IF(SenioriU_50Záp!C15=0,\"\",SenioriU_50Záp!C15)","v":"Nedbal Jaroslav"},{"$f":"IF(SenioriU_50Záp!D15=0,\"\",SenioriU_50Záp!D15)","v":2629},{"$f":"IF(SenioriU_50Záp!E15=0,\"\",SenioriU_50Záp!E15)","v":"DKK Nové Mesto n. Váhom"},{"$f":"IF(SenioriU_50Záp!F15=0,\"\",SenioriU_50Záp!F15)","v":344},{"$f":"IF(SenioriU_50Záp!G15=0,\"\",SenioriU_50Záp!G15)","v":141},{"$f":"IF(SenioriU_50Záp!H15=\"\",\"\",SenioriU_50Záp!H15)","v":12},{"$f":"IF(SenioriU_50Záp!I15=0,\"\",SenioriU_50Záp!I15)","v":485},{"$f":"SenioriU_50Záp!K15","v":"áno"}]
[null,"13.",{"$f":"IF(SenioriU_50Záp!C16=0,\"\",SenioriU_50Záp!C16)","v":"Moravčík Roman"},{"$f":"IF(SenioriU_50Záp!D16=0,\"\",SenioriU_50Záp!D16)","v":8038},{"$f":"IF(SenioriU_50Záp!E16=0,\"\",SenioriU_50Záp!E16)","v":"DKK Nové Mesto n. Váhom"},{"$f":"IF(SenioriU_50Záp!F16=0,\"\",SenioriU_50Záp!F16)","v":349},{"$f":"IF(SenioriU_50Záp!G16=0,\"\",SenioriU_50Záp!G16)","v":164},{"$f":"IF(SenioriU_50Záp!H16=\"\",\"\",SenioriU_50Záp!H16)","v":7},{"$f":"IF(SenioriU_50Záp!I16=0,\"\",SenioriU_50Záp!I16)","v":513},{"$f":"SenioriU_50Záp!K16","v":"áno"}]
[null,"14.",{"$f":"IF(SenioriU_50Záp!C17=0,\"\",SenioriU_50Záp!C17)","v":"Luščík Libor"},{"$f":"IF(SenioriU_50Záp!D17=0,\"\",SenioriU_50Záp!D17)","v":2638},{"$f":"IF(SenioriU_50Záp!E17=0,\"\",SenioriU_50Záp!E17)","v":"DKK Nové Mesto n. Váhom"},{"$f":"IF(SenioriU_50Záp!F17=0,\"\",SenioriU_50Záp!F17)","v":337},{"$f":"IF(SenioriU_50Záp!G17=0,\"\",SenioriU_50Záp!G17)","v":146},{"$f":"IF(SenioriU_50Záp!H17=\"\",\"\",SenioriU_50Záp!H17)","v":17},{"$f":"IF(SenioriU_50Záp!I17=0,\"\",SenioriU_50Záp!I17)","v":483},{"$f":"SenioriU_50Záp!K17","v":"áno"}]
[null,"15.",{"$f":"IF(SenioriU_50Záp!C18=0,\"\",SenioriU_50Záp!C18)","v":"Hochel Ján"},{"$f":"IF(SenioriU_50Záp!D18=0,\"\",SenioriU_50Záp!D18)","v":7876},{"$f":"IF(SenioriU_50Záp!E18=0,\"\",SenioriU_50Záp!E18)","v":"MKK Stará Turá"},{"$f":"IF(SenioriU_50Záp!F18=0,\"\",SenioriU_50Záp!F18)","v":375},{"$f":"IF(SenioriU_50Záp!G18=0,\"\",SenioriU_50Záp!G18)","v":181},{"$f":"IF(SenioriU_50Záp!H18=\"\",\"\",SenioriU_50Záp!H18)","v":7},{"$f":"IF(SenioriU_50Záp!I18=0,\"\",SenioriU_50Záp!I18)","v":556},{"$f":"SenioriU_50Záp!K18","v":"áno"}]
[null,"16.",{"$f":"IF(SenioriU_50Záp!C19=0,\"\",SenioriU_50Záp!C19)","v":"Stejskal Igor"},{"$f":"IF(SenioriU_50Záp!D19=0,\"\",SenioriU_50Záp!D19)","v":7882},{"$f":"IF(SenioriU_50Záp!E19=0,\"\",SenioriU_50Záp!E19)","v":"MKK Stará Turá"},{"$f":"IF(SenioriU_50Záp!F19=0,\"\",SenioriU_50Záp!F19)","v":351},{"$f":"IF(SenioriU_50Záp!G19=0,\"\",SenioriU_50Záp!G19)","v":173},{"$f":"IF(SenioriU_50Záp!H19=\"\",\"\",SenioriU_50Záp!H19)","v":3},{"$f":"IF(SenioriU_50Záp!I19=0,\"\",SenioriU_50Záp!I19)","v":524},{"$f":"SenioriU_50Záp!K19","v":"áno"}]
[null,"17.",{"$f":"IF(SenioriU_50Záp!C20=0,\"\",SenioriU_50Záp!C20)","v":"Štefka Ľubomír"},{"$f":"IF(SenioriU_50Záp!D20=0,\"\",SenioriU_50Záp!D20)","v":506},{"$f":"IF(SenioriU_50Záp!E20=0,\"\",SenioriU_50Záp!E20)","v":"MKK Stará Turá"},{"$f":"IF(SenioriU_50Záp!F20=0,\"\",SenioriU_50Záp!F20)","v":356},{"$f":"IF(SenioriU_50Záp!G20=0,\"\",SenioriU_50Záp!G20)","v":185},{"$f":"IF(SenioriU_50Záp!H20=\"\",\"\",SenioriU_50Záp!H20)","v":5},{"$f":"IF(SenioriU_50Záp!I20=0,\"\",SenioriU_50Záp!I20)","v":541},{"$f":"SenioriU_50Záp!K20","v":"áno"}]
[null,"18.",{"$f":"IF(SenioriU_50Záp!C21=0,\"\",SenioriU_50Záp!C21)","v":"Nemček Peter"},{"$f":"IF(SenioriU_50Záp!D21=0,\"\",SenioriU_50Záp!D21)","v":297},{"$f":"IF(SenioriU_50Záp!E21=0,\"\",SenioriU_50Záp!E21)","v":"MKK Stará Turá"},{"$f":"IF(SenioriU_50Záp!F21=0,\"\",SenioriU_50Záp!F21)","v":349},{"$f":"IF(SenioriU_50Záp!G21=0,\"\",SenioriU_50Záp!G21)","v":194},{"$f":"IF(SenioriU_50Záp!H21=\"\",\"\",SenioriU_50Záp!H21)","v":1},{"$f":"IF(SenioriU_50Záp!I21=0,\"\",SenioriU_50Záp!I21)","v":543},{"$f":"SenioriU_50Záp!K21","v":"áno"}]
[null,"19.",{"$f":"IF(SenioriU_50Záp!C22=0,\"\",SenioriU_50Záp!C22)","v":"Pavlík Peter"},{"$f":"IF(SenioriU_50Záp!D22=0,\"\",SenioriU_50Záp!D22)","v":7964},{"$f":"IF(SenioriU_50Záp!E22=0,\"\",SenioriU_50Záp!E22)","v":"TKK Trenčín"},{"$f":"IF(SenioriU_50Záp!F22=0,\"\",SenioriU_50Záp!F22)","v":360},{"$f":"IF(SenioriU_50Záp!G22=0,\"\",SenioriU_50Záp!G22)","v":176},{"$f":"IF(SenioriU_50Záp!H22=\"\",\"\",SenioriU_50Záp!H22)","v":3},{"$f":"IF(SenioriU_50Záp!I22=0,\"\",SenioriU_50Záp!I22)","v":536},{"$f":"SenioriU_50Záp!K22","v":"áno"}]
[null,"20.",{"$f":"IF(SenioriU_50Záp!C23=0,\"\",SenioriU_50Záp!C23)","v":"Cích Branislav"},{"$f":"IF(SenioriU_50Záp!D23=0,\"\",SenioriU_50Záp!D23)","v":7957},{"$f":"IF(SenioriU_50Záp!E23=0,\"\",SenioriU_50Záp!E23)","v":"TKK Trenčín"},{"$f":"IF(SenioriU_50Záp!F23=0,\"\",SenioriU_50Záp!F23)","v":368},{"$f":"IF(SenioriU_50Záp!G23=0,\"\",SenioriU_50Záp!G23)","v":156},{"$f":"IF(SenioriU_50Záp!H23=\"\",\"\",SenioriU_50Záp!H23)","v":6},{"$f":"IF(SenioriU_50Záp!I23=0,\"\",SenioriU_50Záp!I23)","v":524},{"$f":"SenioriU_50Záp!K23","v":"áno"}]
[null,"21.",{"$f":"IF(SenioriU_50Záp!C24=0,\"\",SenioriU_50Záp!C24)","v":"Podolák Jaroslav"},{"$f":"IF(SenioriU_50Záp!D24=0,\"\",SenioriU_50Záp!D24)","v":7986},{"$f":"IF(SenioriU_50Záp!E24=0,\"\",SenioriU_50Záp!E24)","v":"BKK Bánovce nad Bebravou"},{"$f":"IF(SenioriU_50Záp!F24=0,\"\",SenioriU_50Záp!F24)","v":377},{"$f":"IF(SenioriU_50Záp!G24=0,\"\",SenioriU_50Záp!G24)","v":201},{"$f":"IF(SenioriU_50Záp!H24=\"\",\"\",SenioriU_50Záp!H24)","v":2},{"$f":"IF(SenioriU_50Záp!I24=0,\"\",SenioriU_50Záp!I24)","v":578},{"$f":"SenioriU_50Záp!K24","v":"áno"}]
[null,"22.",{"$f":"IF(SenioriU_50Záp!C25=0,\"\",SenioriU_50Záp!C25)","v":"Adamkovič Dalibor"},{"$f":"IF(SenioriU_50Záp!D25=0,\"\",SenioriU_50Záp!D25)","v":884},{"$f":"IF(SenioriU_50Záp!E25=0,\"\",SenioriU_50Záp!E25)","v":"BKK Bánovce nad Bebravou"},{"$f":"IF(SenioriU_50Záp!F25=0,\"\",SenioriU_50Záp!F25)","v":321},{"$f":"IF(SenioriU_50Záp!G25=0,\"\",SenioriU_50Záp!G25)","v":99},{"$f":"IF(SenioriU_50Záp!H25=\"\",\"\",SenioriU_50Záp!H25)","v":20},{"$f":"IF(SenioriU_50Záp!I25=0,\"\",SenioriU_50Záp!I25)","v":420},{"$f":"SenioriU_50Záp!K25","v":"áno"}]
[null,"23.",{"$f":"IF(SenioriU_50Záp!C26=0,\"\",SenioriU_50Záp!C26)","v":"Moravčík Jozef"},{"$f":"IF(SenioriU_50Záp!D26=0,\"\",SenioriU_50Záp!D26)","v":8220},{"$f":"IF(SenioriU_50Záp!E26=0,\"\",SenioriU_50Záp!E26)","v":"MKK Stará Turá"},{"$f":"IF(SenioriU_50Záp!F26=0,\"\",SenioriU_50Záp!F26)","v":345},{"$f":"IF(SenioriU_50Záp!G26=0,\"\",SenioriU_50Záp!G26)","v":132},{"$f":"IF(SenioriU_50Záp!H26=\"\",\"\",SenioriU_50Záp!H26)","v":14},{"$f":"IF(SenioriU_50Záp!I26=0,\"\",SenioriU_50Záp!I26)","v":477},{"$f":"SenioriU_50Záp!K26","v":"áno"}]
[null,"24.",{"$f":"IF(SenioriU_50Záp!C27=0,\"\",SenioriU_50Záp!C27)","v":"Miškovič Marian"},{"$f":"IF(SenioriU_50Záp!D27=0,\"\",SenioriU_50Záp!D27)","v":7883},{"$f":"IF(SenioriU_50Záp!E27=0,\"\",SenioriU_50Záp!E27)","v":"MKK Stará Turá"},{"$f":"IF(SenioriU_50Záp!F27=0,\"\",SenioriU_50Záp!F27)","v":374},{"$f":"IF(SenioriU_50Záp!G27=0,\"\",SenioriU_50Záp!G27)","v":157},{"$f":"IF(SenioriU_50Záp!H27=\"\",\"\",SenioriU_50Záp!H27)","v":7},{"$f":"IF(SenioriU_50Záp!I27=0,\"\",SenioriU_50Záp!I27)","v":531},{"$f":"SenioriU_50Záp!K27","v":"áno"}]
[null,"25.",{"$f":"IF(SenioriU_50Záp!C28=0,\"\",SenioriU_50Záp!C28)","v":"Fodora Peter"},{"$f":"IF(SenioriU_50Záp!D28=0,\"\",SenioriU_50Záp!D28)","v":885},{"$f":"IF(SenioriU_50Záp!E28=0,\"\",SenioriU_50Záp!E28)","v":"BKK Bánovce nad Bebravou"},{"$f":"IF(SenioriU_50Záp!F28=0,\"\",SenioriU_50Záp!F28)","v":340},{"$f":"IF(SenioriU_50Záp!G28=0,\"\",SenioriU_50Záp!G28)","v":148},{"$f":"IF(SenioriU_50Záp!H28=\"\",\"\",SenioriU_50Záp!H28)","v":13},{"$f":"IF(SenioriU_50Záp!I28=0,\"\",SenioriU_50Záp!I28)","v":488},{"$f":"SenioriU_50Záp!K28","v":"áno"}]
[null,"26.",{"$f":"IF(SenioriU_50Záp!C29=0,\"\",SenioriU_50Záp!C29)","v":""},{"$f":"IF(SenioriU_50Záp!D29=0,\"\",SenioriU_50Záp!D29)","v":""},{"$f":"IF(SenioriU_50Záp!E29=0,\"\",SenioriU_50Záp!E29)","v":""},{"$f":"IF(SenioriU_50Záp!F29=0,\"\",SenioriU_50Záp!F29)","v":""},{"$f":"IF(SenioriU_50Záp!G29=0,\"\",SenioriU_50Záp!G29)","v":""},{"$f":"IF(SenioriU_50Záp!H29=\"\",\"\",SenioriU_50Záp!H29)","v":""},{"$f":"IF(SenioriU_50Záp!I29=0,\"\",SenioriU_50Záp!I29)","v":""},{"$f":"SenioriU_50Záp!K29","v":"nie"}]
[null,"27.",{"$f":"IF(SenioriU_50Záp!C30=0,\"\",SenioriU_50Záp!C30)","v":""},{"$f":"IF(SenioriU_50Záp!D30=0,\"\",SenioriU_50Záp!D30)","v":""},{"$f":"IF(SenioriU_50Záp!E30=0,\"\",SenioriU_50Záp!E30)","v":""},{"$f":"IF(SenioriU_50Záp!F30=0,\"\",SenioriU_50Záp!F30)","v":""},{"$f":"IF(SenioriU_50Záp!G30=0,\"\",SenioriU_50Záp!G30)","v":""},{"$f":"IF(SenioriU_50Záp!H30=\"\",\"\",SenioriU_50Záp!H30)","v":""},{"$f":"IF(SenioriU_50Záp!I30=0,\"\",SenioriU_50Záp!I30)","v":""},{"$f":"SenioriU_50Záp!K30","v":"nie"}]
[null,"28.",{"$f":"IF(SenioriU_50Záp!C31=0,\"\",SenioriU_50Záp!C31)","v":""},{"$f":"IF(SenioriU_50Záp!D31=0,\"\",SenioriU_50Záp!D31)","v":""},{"$f":"IF(SenioriU_50Záp!E31=0,\"\",SenioriU_50Záp!E31)","v":""},{"$f":"IF(SenioriU_50Záp!F31=0,\"\",SenioriU_50Záp!F31)","v":""},{"$f":"IF(SenioriU_50Záp!G31=0,\"\",SenioriU_50Záp!G31)","v":""},{"$f":"IF(SenioriU_50Záp!H31=\"\",\"\",SenioriU_50Záp!H31)","v":""},{"$f":"IF(SenioriU_50Záp!I31=0,\"\",SenioriU_50Záp!I31)","v":""},{"$f":"SenioriU_50Záp!K31","v":"nie"}]
[null,"29.",{"$f":"IF(SenioriU_50Záp!C32=0,\"\",SenioriU_50Záp!C32)","v":""},{"$f":"IF(SenioriU_50Záp!D32=0,\"\",SenioriU_50Záp!D32)","v":""},{"$f":"IF(SenioriU_50Záp!E32=0,\"\",SenioriU_50Záp!E32)","v":""},{"$f":"IF(SenioriU_50Záp!F32=0,\"\",SenioriU_50Záp!F32)","v":""},{"$f":"IF(SenioriU_50Záp!G32=0,\"\",SenioriU_50Záp!G32)","v":""},{"$f":"IF(SenioriU_50Záp!H32=\"\",\"\",SenioriU_50Záp!H32)","v":""},{"$f":"IF(SenioriU_50Záp!I32=0,\"\",SenioriU_50Záp!I32)","v":""},{"$f":"SenioriU_50Záp!K32","v":"nie"}]
[null,"30.",{"$f":"IF(SenioriU_50Záp!C33=0,\"\",SenioriU_50Záp!C33)","v":""},{"$f":"IF(SenioriU_50Záp!D33=0,\"\",SenioriU_50Záp!D33)","v":""},{"$f":"IF(SenioriU_50Záp!E33=0,\"\",SenioriU_50Záp!E33)","v":""},{"$f":"IF(SenioriU_50Záp!F33=0,\"\",SenioriU_50Záp!F33)","v":""},{"$f":"IF(SenioriU_50Záp!G33=0,\"\",SenioriU_50Záp!G33)","v":""},{"$f":"IF(SenioriU_50Záp!H33=\"\",\"\",SenioriU_50Záp!H33)","v":""},{"$f":"IF(SenioriU_50Záp!I33=0,\"\",SenioriU_50Záp!I33)","v":""},{"$f":"SenioriU_50Záp!K33","v":"nie"}]
[null,"31.",{"$f":"IF(SenioriU_50Záp!C34=0,\"\",SenioriU_50Záp!C34)","v":""},{"$f":"IF(SenioriU_50Záp!D34=0,\"\",SenioriU_50Záp!D34)","v":""},{"$f":"IF(SenioriU_50Záp!E34=0,\"\",SenioriU_50Záp!E34)","v":""},{"$f":"IF(SenioriU_50Záp!F34=0,\"\",SenioriU_50Záp!F34)","v":""},{"$f":"IF(SenioriU_50Záp!G34=0,\"\",SenioriU_50Záp!G34)","v":""},{"$f":"IF(SenioriU_50Záp!H34=\"\",\"\",SenioriU_50Záp!H34)","v":""},{"$f":"IF(SenioriU_50Záp!I34=0,\"\",SenioriU_50Záp!I34)","v":""},{"$f":"SenioriU_50Záp!K34","v":"nie"}]
[null,"32.",{"$f":"IF(SenioriU_50Záp!C35=0,\"\",SenioriU_50Záp!C35)","v":""},{"$f":"IF(SenioriU_50Záp!D35=0,\"\",SenioriU_50Záp!D35)","v":""},{"$f":"IF(SenioriU_50Záp!E35=0,\"\",SenioriU_50Záp!E35)","v":""},{"$f":"IF(SenioriU_50Záp!F35=0,\"\",SenioriU_50Záp!F35)","v":""},{"$f":"IF(SenioriU_50Záp!G35=0,\"\",SenioriU_50Záp!G35)","v":""},{"$f":"IF(SenioriU_50Záp!H35=\"\",\"\",SenioriU_50Záp!H35)","v":""},{"$f":"IF(SenioriU_50Záp!I35=0,\"\",SenioriU_50Záp!I35)","v":""},{"$f":"SenioriU_50Záp!K35","v":"nie"}]
[null,"33.",{"$f":"IF(SenioriU_50Záp!C36=0,\"\",SenioriU_50Záp!C36)","v":""},{"$f":"IF(SenioriU_50Záp!D36=0,\"\",SenioriU_50Záp!D36)","v":""},{"$f":"IF(SenioriU_50Záp!E36=0,\"\",SenioriU_50Záp!E36)","v":""},{"$f":"IF(SenioriU_50Záp!F36=0,\"\",SenioriU_50Záp!F36)","v":""},{"$f":"IF(SenioriU_50Záp!G36=0,\"\",SenioriU_50Záp!G36)","v":""},{"$f":"IF(SenioriU_50Záp!H36=\"\",\"\",SenioriU_50Záp!H36)","v":""},{"$f":"IF(SenioriU_50Záp!I36=0,\"\",SenioriU_50Záp!I36)","v":""},{"$f":"SenioriU_50Záp!K36","v":"nie"}]
[null,"34.",{"$f":"IF(SenioriU_50Záp!C37=0,\"\",SenioriU_50Záp!C37)","v":""},{"$f":"IF(SenioriU_50Záp!D37=0,\"\",SenioriU_50Záp!D37)","v":""},{"$f":"IF(SenioriU_50Záp!E37=0,\"\",SenioriU_50Záp!E37)","v":""},{"$f":"IF(SenioriU_50Záp!F37=0,\"\",SenioriU_50Záp!F37)","v":""},{"$f":"IF(SenioriU_50Záp!G37=0,\"\",SenioriU_50Záp!G37)","v":""},{"$f":"IF(SenioriU_50Záp!H37=\"\",\"\",SenioriU_50Záp!H37)","v":""},{"$f":"IF(SenioriU_50Záp!I37=0,\"\",SenioriU_50Záp!I37)","v":""},{"$f":"SenioriU_50Záp!K37","v":"nie"}]
[null,"35.",{"$f":"IF(SenioriU_50Záp!C38=0,\"\",SenioriU_50Záp!C38)","v":""},{"$f":"IF(SenioriU_50Záp!D38=0,\"\",SenioriU_50Záp!D38)","v":""},{"$f":"IF(SenioriU_50Záp!E38=0,\"\",SenioriU_50Záp!E38)","v":""},{"$f":"IF(SenioriU_50Záp!F38=0,\"\",SenioriU_50Záp!F38)","v":""},{"$f":"IF(SenioriU_50Záp!G38=0,\"\",SenioriU_50Záp!G38)","v":""},{"$f":"IF(SenioriU_50Záp!H38=\"\",\"\",SenioriU_50Záp!H38)","v":""},{"$f":"IF(SenioriU_50Záp!I38=0,\"\",SenioriU_50Záp!I38)","v":""},{"$f":"SenioriU_50Záp!K38","v":"nie"}]
[null,"36.",{"$f":"IF(SenioriU_50Záp!C39=0,\"\",SenioriU_50Záp!C39)","v":""},{"$f":"IF(SenioriU_50Záp!D39=0,\"\",SenioriU_50Záp!D39)","v":""},{"$f":"IF(SenioriU_50Záp!E39=0,\"\",SenioriU_50Záp!E39)","v":""},{"$f":"IF(SenioriU_50Záp!F39=0,\"\",SenioriU_50Záp!F39)","v":""},{"$f":"IF(SenioriU_50Záp!G39=0,\"\",SenioriU_50Záp!G39)","v":""},{"$f":"IF(SenioriU_50Záp!H39=\"\",\"\",SenioriU_50Záp!H39)","v":""},{"$f":"IF(SenioriU_50Záp!I39=0,\"\",SenioriU_50Záp!I39)","v":""},{"$f":"SenioriU_50Záp!K39","v":"nie"}]
[null,"37.",{"$f":"IF(SenioriU_50Záp!C40=0,\"\",SenioriU_50Záp!C40)","v":""},{"$f":"IF(SenioriU_50Záp!D40=0,\"\",SenioriU_50Záp!D40)","v":""},{"$f":"IF(SenioriU_50Záp!E40=0,\"\",SenioriU_50Záp!E40)","v":""},{"$f":"IF(SenioriU_50Záp!F40=0,\"\",SenioriU_50Záp!F40)","v":""},{"$f":"IF(SenioriU_50Záp!G40=0,\"\",SenioriU_50Záp!G40)","v":""},{"$f":"IF(SenioriU_50Záp!H40=\"\",\"\",SenioriU_50Záp!H40)","v":""},{"$f":"IF(SenioriU_50Záp!I40=0,\"\",SenioriU_50Záp!I40)","v":""},{"$f":"SenioriU_50Záp!K40","v":"nie"}]
[null,"38.",{"$f":"IF(SenioriU_50Záp!C41=0,\"\",SenioriU_50Záp!C41)","v":""},{"$f":"IF(SenioriU_50Záp!D41=0,\"\",SenioriU_50Záp!D41)","v":""},{"$f":"IF(SenioriU_50Záp!E41=0,\"\",SenioriU_50Záp!E41)","v":""},{"$f":"IF(SenioriU_50Záp!F41=0,\"\",SenioriU_50Záp!F41)","v":""},{"$f":"IF(SenioriU_50Záp!G41=0,\"\",SenioriU_50Záp!G41)","v":""},{"$f":"IF(SenioriU_50Záp!H41=\"\",\"\",SenioriU_50Záp!H41)","v":""},{"$f":"IF(SenioriU_50Záp!I41=0,\"\",SenioriU_50Záp!I41)","v":""},{"$f":"SenioriU_50Záp!K41","v":"nie"}]
[null,"39.",{"$f":"IF(SenioriU_50Záp!C42=0,\"\",SenioriU_50Záp!C42)","v":""},{"$f":"IF(SenioriU_50Záp!D42=0,\"\",SenioriU_50Záp!D42)","v":""},{"$f":"IF(SenioriU_50Záp!E42=0,\"\",SenioriU_50Záp!E42)","v":""},{"$f":"IF(SenioriU_50Záp!F42=0,\"\",SenioriU_50Záp!F42)","v":""},{"$f":"IF(SenioriU_50Záp!G42=0,\"\",SenioriU_50Záp!G42)","v":""},{"$f":"IF(SenioriU_50Záp!H42=\"\",\"\",SenioriU_50Záp!H42)","v":""},{"$f":"IF(SenioriU_50Záp!I42=0,\"\",SenioriU_50Záp!I42)","v":""},{"$f":"SenioriU_50Záp!K42","v":"nie"}]
[null,"40.",{"$f":"IF(SenioriU_50Záp!C43=0,\"\",SenioriU_50Záp!C43)","v":""},{"$f":"IF(SenioriU_50Záp!D43=0,\"\",SenioriU_50Záp!D43)","v":""},{"$f":"IF(SenioriU_50Záp!E43=0,\"\",SenioriU_50Záp!E43)","v":""},{"$f":"IF(SenioriU_50Záp!F43=0,\"\",SenioriU_50Záp!F43)","v":""},{"$f":"IF(SenioriU_50Záp!G43=0,\"\",SenioriU_50Záp!G43)","v":""},{"$f":"IF(SenioriU_50Záp!H43=\"\",\"\",SenioriU_50Záp!H43)","v":""},{"$f":"IF(SenioriU_50Záp!I43=0,\"\",SenioriU_50Záp!I43)","v":""},{"$f":"SenioriU_50Záp!K43","v":"nie"}]
[null,"41.",{"$f":"IF(SenioriU_50Záp!C44=0,\"\",SenioriU_50Záp!C44)","v":""},{"$f":"IF(SenioriU_50Záp!D44=0,\"\",SenioriU_50Záp!D44)","v":""},{"$f":"IF(SenioriU_50Záp!E44=0,\"\",SenioriU_50Záp!E44)","v":""},{"$f":"IF(SenioriU_50Záp!F44=0,\"\",SenioriU_50Záp!F44)","v":""},{"$f":"IF(SenioriU_50Záp!G44=0,\"\",SenioriU_50Záp!G44)","v":""},{"$f":"IF(SenioriU_50Záp!H44=\"\",\"\",SenioriU_50Záp!H44)","v":""},{"$f":"IF(SenioriU_50Záp!I44=0,\"\",SenioriU_50Záp!I44)","v":""},{"$f":"SenioriU_50Záp!K44","v":"nie"}]
[null,"42.",{"$f":"IF(SenioriU_50Záp!C45=0,\"\",SenioriU_50Záp!C45)","v":""},{"$f":"IF(SenioriU_50Záp!D45=0,\"\",SenioriU_50Záp!D45)","v":""},{"$f":"IF(SenioriU_50Záp!E45=0,\"\",SenioriU_50Záp!E45)","v":""},{"$f":"IF(SenioriU_50Záp!F45=0,\"\",SenioriU_50Záp!F45)","v":""},{"$f":"IF(SenioriU_50Záp!G45=0,\"\",SenioriU_50Záp!G45)","v":""},{"$f":"IF(SenioriU_50Záp!H45=\"\",\"\",SenioriU_50Záp!H45)","v":""},{"$f":"IF(SenioriU_50Záp!I45=0,\"\",SenioriU_50Záp!I45)","v":""},{"$f":"SenioriU_50Záp!K45","v":"nie"}]
[null,"43.",{"$f":"IF(SenioriU_50Záp!C46=0,\"\",SenioriU_50Záp!C46)","v":""},{"$f":"IF(SenioriU_50Záp!D46=0,\"\",SenioriU_50Záp!D46)","v":""},{"$f":"IF(SenioriU_50Záp!E46=0,\"\",SenioriU_50Záp!E46)","v":""},{"$f":"IF(SenioriU_50Záp!F46=0,\"\",SenioriU_50Záp!F46)","v":""},{"$f":"IF(SenioriU_50Záp!G46=0,\"\",SenioriU_50Záp!G46)","v":""},{"$f":"IF(SenioriU_50Záp!H46=\"\",\"\",SenioriU_50Záp!H46)","v":""},{"$f":"IF(SenioriU_50Záp!I46=0,\"\",SenioriU_50Záp!I46)","v":""},{"$f":"SenioriU_50Záp!K46","v":"nie"}]
[null,"44.",{"$f":"IF(SenioriU_50Záp!C47=0,\"\",SenioriU_50Záp!C47)","v":""},{"$f":"IF(SenioriU_50Záp!D47=0,\"\",SenioriU_50Záp!D47)","v":""},{"$f":"IF(SenioriU_50Záp!E47=0,\"\",SenioriU_50Záp!E47)","v":""},{"$f":"IF(SenioriU_50Záp!F47=0,\"\",SenioriU_50Záp!F47)","v":""},{"$f":"IF(SenioriU_50Záp!G47=0,\"\",SenioriU_50Záp!G47)","v":""},{"$f":"IF(SenioriU_50Záp!H47=\"\",\"\",SenioriU_50Záp!H47)","v":""},{"$f":"IF(SenioriU_50Záp!I47=0,\"\",SenioriU_50Záp!I47)","v":""},{"$f":"SenioriU_50Záp!K47","v":"nie"}]
[null,"45.",{"$f":"IF(SenioriU_50Záp!C48=0,\"\",SenioriU_50Záp!C48)","v":""},{"$f":"IF(SenioriU_50Záp!D48=0,\"\",SenioriU_50Záp!D48)","v":""},{"$f":"IF(SenioriU_50Záp!E48=0,\"\",SenioriU_50Záp!E48)","v":""},{"$f":"IF(SenioriU_50Záp!F48=0,\"\",SenioriU_50Záp!F48)","v":""},{"$f":"IF(SenioriU_50Záp!G48=0,\"\",SenioriU_50Záp!G48)","v":""},{"$f":"IF(SenioriU_50Záp!H48=\"\",\"\",SenioriU_50Záp!H48)","v":""},{"$f":"IF(SenioriU_50Záp!I48=0,\"\",SenioriU_50Záp!I48)","v":""},{"$f":"SenioriU_50Záp!K48","v":"nie"}]
[null,"46.",{"$f":"IF(SenioriU_50Záp!C49=0,\"\",SenioriU_50Záp!C49)","v":""},{"$f":"IF(SenioriU_50Záp!D49=0,\"\",SenioriU_50Záp!D49)","v":""},{"$f":"IF(SenioriU_50Záp!E49=0,\"\",SenioriU_50Záp!E49)","v":""},{"$f":"IF(SenioriU_50Záp!F49=0,\"\",SenioriU_50Záp!F49)","v":""},{"$f":"IF(SenioriU_50Záp!G49=0,\"\",SenioriU_50Záp!G49)","v":""},{"$f":"IF(SenioriU_50Záp!H49=\"\",\"\",SenioriU_50Záp!H49)","v":""},{"$f":"IF(SenioriU_50Záp!I49=0,\"\",SenioriU_50Záp!I49)","v":""},{"$f":"SenioriU_50Záp!K49","v":"nie"}]
[null,"47.",{"$f":"IF(SenioriU_50Záp!C50=0,\"\",SenioriU_50Záp!C50)","v":""},{"$f":"IF(SenioriU_50Záp!D50=0,\"\",SenioriU_50Záp!D50)","v":""},{"$f":"IF(SenioriU_50Záp!E50=0,\"\",SenioriU_50Záp!E50)","v":""},{"$f":"IF(SenioriU_50Záp!F50=0,\"\",SenioriU_50Záp!F50)","v":""},{"$f":"IF(SenioriU_50Záp!G50=0,\"\",SenioriU_50Záp!G50)","v":""},{"$f":"IF(SenioriU_50Záp!H50=\"\",\"\",SenioriU_50Záp!H50)","v":""},{"$f":"IF(SenioriU_50Záp!I50=0,\"\",SenioriU_50Záp!I50)","v":""},{"$f":"SenioriU_50Záp!K50","v":"nie"}]
[null,"48.",{"$f":"IF(SenioriU_50Záp!C51=0,\"\",SenioriU_50Záp!C51)","v":""},{"$f":"IF(SenioriU_50Záp!D51=0,\"\",SenioriU_50Záp!D51)","v":""},{"$f":"IF(SenioriU_50Záp!E51=0,\"\",SenioriU_50Záp!E51)","v":""},{"$f":"IF(SenioriU_50Záp!F51=0,\"\",SenioriU_50Záp!F51)","v":""},{"$f":"IF(SenioriU_50Záp!G51=0,\"\",SenioriU_50Záp!G51)","v":""},{"$f":"IF(SenioriU_50Záp!H51=\"\",\"\",SenioriU_50Záp!H51)","v":""},{"$f":"IF(SenioriU_50Záp!I51=0,\"\",SenioriU_50Záp!I51)","v":""},{"$f":"SenioriU_50Záp!K51","v":"nie"}]
[]
[null,"Kraj :",null,{"$f":"SeniorkyU_50Záp!$F$1","v":"Trenčiansky"},null,null,{"$f":"SeniorkyU_50Záp!$H$2","v":"31.3.2019"}]
[null,"MK senioriek U-50 2019",null,null,"Kolkáreň :",{"$f":"SeniorkyU_50Záp!$E$2","v":"Trenčín"}]
[]
[null,"Por.","Hráči","Č.r.p.","Klub","Plné","Dorážka","Chyby","Spolu"]
[]
[null,"1.",{"$f":"IF(SeniorkyU_50Záp!C4=0,\"\",SeniorkyU_50Záp!C4)","v":"Bošnáková Janka"},{"$f":"IF(SeniorkyU_50Záp!D4=0,\"\",SeniorkyU_50Záp!D4)","v":7953},{"$f":"IF(SeniorkyU_50Záp!E4=0,\"\",SeniorkyU_50Záp!E4)","v":"TKK Trenčín"},{"$f":"IF(SeniorkyU_50Záp!F4=0,\"\",SeniorkyU_50Záp!F4)","v":385},{"$f":"IF(SeniorkyU_50Záp!G4=0,\"\",SeniorkyU_50Záp!G4)","v":185},{"$f":"IF(SeniorkyU_50Záp!H4=\"\",\"\",SeniorkyU_50Záp!H4)","v":5},{"$f":"IF(SeniorkyU_50Záp!I4=0,\"\",SeniorkyU_50Záp!I4)","v":570},{"$f":"SeniorkyU_50Záp!K4","v":"áno"}]
[null,"2.",{"$f":"IF(SeniorkyU_50Záp!C5=0,\"\",SeniorkyU_50Záp!C5)","v":"Kičinková Eva"},{"$f":"IF(SeniorkyU_50Záp!D5=0,\"\",SeniorkyU_50Záp!D5)","v":1043},{"$f":"IF(SeniorkyU_50Záp!E5=0,\"\",SeniorkyU_50Záp!E5)","v":"TKK Trenčín"},{"$f":"IF(SeniorkyU_50Záp!F5=0,\"\",SeniorkyU_50Záp!F5)","v":371},{"$f":"IF(SeniorkyU_50Záp!G5=0,\"\",SeniorkyU_50Záp!G5)","v":141},{"$f":"IF(SeniorkyU_50Záp!H5=\"\",\"\",SeniorkyU_50Záp!H5)","v":11},{"$f":"IF(SeniorkyU_50Záp!I5=0,\"\",SeniorkyU_50Záp!I5)","v":512},{"$f":"SeniorkyU_50Záp!K5","v":"áno"}]
[null,"3.",{"$f":"IF(SeniorkyU_50Záp!C6=0,\"\",SeniorkyU_50Záp!C6)","v":"Furstenová Elena"},{"$f":"IF(SeniorkyU_50Záp!D6=0,\"\",SeniorkyU_50Záp!D6)","v":2146},{"$f":"IF(SeniorkyU_50Záp!E6=0,\"\",SeniorkyU_50Záp!E6)","v":"TKK Trenčín"},{"$f":"IF(SeniorkyU_50Záp!F6=0,\"\",SeniorkyU_50Záp!F6)","v":""},{"$f":"IF(SeniorkyU_50Záp!G6=0,\"\",SeniorkyU_50Záp!G6)","v":{"$error":"#VALUE!"}},{"$f":"IF(SeniorkyU_50Záp!H6=\"\",\"\",SeniorkyU_50Záp!H6)","v":""},{"$f":"IF(SeniorkyU_50Záp!I6=0,\"\",SeniorkyU_50Záp!I6)","v":"Skreč"},{"$f":"SeniorkyU_50Záp!K6","v":"áno"}]
[null,"4.",{"$f":"IF(SeniorkyU_50Záp!C7=0,\"\",SeniorkyU_50Záp!C7)","v":""},{"$f":"IF(SeniorkyU_50Záp!D7=0,\"\",SeniorkyU_50Záp!D7)","v":""},{"$f":"IF(SeniorkyU_50Záp!E7=0,\"\",SeniorkyU_50Záp!E7)","v":""},{"$f":"IF(SeniorkyU_50Záp!F7=0,\"\",SeniorkyU_50Záp!F7)","v":""},{"$f":"IF(SeniorkyU_50Záp!G7=0,\"\",SeniorkyU_50Záp!G7)","v":""},{"$f":"IF(SeniorkyU_50Záp!H7=\"\",\"\",SeniorkyU_50Záp!H7)","v":""},{"$f":"IF(SeniorkyU_50Záp!I7=0,\"\",SeniorkyU_50Záp!I7)","v":""},{"$f":"SeniorkyU_50Záp!K7","v":"nie"}]
[null,"5.",{"$f":"IF(SeniorkyU_50Záp!C8=0,\"\",SeniorkyU_50Záp!C8)","v":""},{"$f":"IF(SeniorkyU_50Záp!D8=0,\"\",SeniorkyU_50Záp!D8)","v":""},{"$f":"IF(SeniorkyU_50Záp!E8=0,\"\",SeniorkyU_50Záp!E8)","v":""},{"$f":"IF(SeniorkyU_50Záp!F8=0,\"\",SeniorkyU_50Záp!F8)","v":""},{"$f":"IF(SeniorkyU_50Záp!G8=0,\"\",SeniorkyU_50Záp!G8)","v":""},{"$f":"IF(SeniorkyU_50Záp!H8=\"\",\"\",SeniorkyU_50Záp!H8)","v":""},{"$f":"IF(SeniorkyU_50Záp!I8=0,\"\",SeniorkyU_50Záp!I8)","v":""},{"$f":"SeniorkyU_50Záp!K8","v":"nie"}]
[null,"6.",{"$f":"IF(SeniorkyU_50Záp!C9=0,\"\",SeniorkyU_50Záp!C9)","v":""},{"$f":"IF(SeniorkyU_50Záp!D9=0,\"\",SeniorkyU_50Záp!D9)","v":""},{"$f":"IF(SeniorkyU_50Záp!E9=0,\"\",SeniorkyU_50Záp!E9)","v":""},{"$f":"IF(SeniorkyU_50Záp!F9=0,\"\",SeniorkyU_50Záp!F9)","v":""},{"$f":"IF(SeniorkyU_50Záp!G9=0,\"\",SeniorkyU_50Záp!G9)","v":""},{"$f":"IF(SeniorkyU_50Záp!H9=\"\",\"\",SeniorkyU_50Záp!H9)","v":""},{"$f":"IF(SeniorkyU_50Záp!I9=0,\"\",SeniorkyU_50Záp!I9)","v":""},{"$f":"SeniorkyU_50Záp!K9","v":"nie"}]
[null,"7.",{"$f":"IF(SeniorkyU_50Záp!C10=0,\"\",SeniorkyU_50Záp!C10)","v":""},{"$f":"IF(SeniorkyU_50Záp!D10=0,\"\",SeniorkyU_50Záp!D10)","v":""},{"$f":"IF(SeniorkyU_50Záp!E10=0,\"\",SeniorkyU_50Záp!E10)","v":""},{"$f":"IF(SeniorkyU_50Záp!F10=0,\"\",SeniorkyU_50Záp!F10)","v":""},{"$f":"IF(SeniorkyU_50Záp!G10=0,\"\",SeniorkyU_50Záp!G10)","v":""},{"$f":"IF(SeniorkyU_50Záp!H10=\"\",\"\",SeniorkyU_50Záp!H10)","v":""},{"$f":"IF(SeniorkyU_50Záp!I10=0,\"\",SeniorkyU_50Záp!I10)","v":""},{"$f":"SeniorkyU_50Záp!K10","v":"nie"}]
[null,"8.",{"$f":"IF(SeniorkyU_50Záp!C11=0,\"\",SeniorkyU_50Záp!C11)","v":""},{"$f":"IF(SeniorkyU_50Záp!D11=0,\"\",SeniorkyU_50Záp!D11)","v":""},{"$f":"IF(SeniorkyU_50Záp!E11=0,\"\",SeniorkyU_50Záp!E11)","v":""},{"$f":"IF(SeniorkyU_50Záp!F11=0,\"\",SeniorkyU_50Záp!F11)","v":""},{"$f":"IF(SeniorkyU_50Záp!G11=0,\"\",SeniorkyU_50Záp!G11)","v":""},{"$f":"IF(SeniorkyU_50Záp!H11=\"\",\"\",SeniorkyU_50Záp!H11)","v":""},{"$f":"IF(SeniorkyU_50Záp!I11=0,\"\",SeniorkyU_50Záp!I11)","v":""},{"$f":"SeniorkyU_50Záp!K11","v":"nie"}]
[null,"9.",{"$f":"IF(SeniorkyU_50Záp!C12=0,\"\",SeniorkyU_50Záp!C12)","v":""},{"$f":"IF(SeniorkyU_50Záp!D12=0,\"\",SeniorkyU_50Záp!D12)","v":""},{"$f":"IF(SeniorkyU_50Záp!E12=0,\"\",SeniorkyU_50Záp!E12)","v":""},{"$f":"IF(SeniorkyU_50Záp!F12=0,\"\",SeniorkyU_50Záp!F12)","v":""},{"$f":"IF(SeniorkyU_50Záp!G12=0,\"\",SeniorkyU_50Záp!G12)","v":""},{"$f":"IF(SeniorkyU_50Záp!H12=\"\",\"\",SeniorkyU_50Záp!H12)","v":""},{"$f":"IF(SeniorkyU_50Záp!I12=0,\"\",SeniorkyU_50Záp!I12)","v":""},{"$f":"SeniorkyU_50Záp!K12","v":"nie"}]
[null,"10.",{"$f":"IF(SeniorkyU_50Záp!C13=0,\"\",SeniorkyU_50Záp!C13)","v":""},{"$f":"IF(SeniorkyU_50Záp!D13=0,\"\",SeniorkyU_50Záp!D13)","v":""},{"$f":"IF(SeniorkyU_50Záp!E13=0,\"\",SeniorkyU_50Záp!E13)","v":""},{"$f":"IF(SeniorkyU_50Záp!F13=0,\"\",SeniorkyU_50Záp!F13)","v":""},{"$f":"IF(SeniorkyU_50Záp!G13=0,\"\",SeniorkyU_50Záp!G13)","v":""},{"$f":"IF(SeniorkyU_50Záp!H13=\"\",\"\",SeniorkyU_50Záp!H13)","v":""},{"$f":"IF(SeniorkyU_50Záp!I13=0,\"\",SeniorkyU_50Záp!I13)","v":""},{"$f":"SeniorkyU_50Záp!K13","v":"nie"}]
[null,"11.",{"$f":"IF(SeniorkyU_50Záp!C14=0,\"\",SeniorkyU_50Záp!C14)","v":""},{"$f":"IF(SeniorkyU_50Záp!D14=0,\"\",SeniorkyU_50Záp!D14)","v":""},{"$f":"IF(SeniorkyU_50Záp!E14=0,\"\",SeniorkyU_50Záp!E14)","v":""},{"$f":"IF(SeniorkyU_50Záp!F14=0,\"\",SeniorkyU_50Záp!F14)","v":""},{"$f":"IF(SeniorkyU_50Záp!G14=0,\"\",SeniorkyU_50Záp!G14)","v":""},{"$f":"IF(SeniorkyU_50Záp!H14=\"\",\"\",SeniorkyU_50Záp!H14)","v":""},{"$f":"IF(SeniorkyU_50Záp!I14=0,\"\",SeniorkyU_50Záp!I14)","v":""},{"$f":"SeniorkyU_50Záp!K14","v":"nie"}]
[null,"12.",{"$f":"IF(SeniorkyU_50Záp!C15=0,\"\",SeniorkyU_50Záp!C15)","v":""},{"$f":"IF(SeniorkyU_50Záp!D15=0,\"\",SeniorkyU_50Záp!D15)","v":""},{"$f":"IF(SeniorkyU_50Záp!E15=0,\"\",SeniorkyU_50Záp!E15)","v":""},{"$f":"IF(SeniorkyU_50Záp!F15=0,\"\",SeniorkyU_50Záp!F15)","v":""},{"$f":"IF(SeniorkyU_50Záp!G15=0,\"\",SeniorkyU_50Záp!G15)","v":""},{"$f":"IF(SeniorkyU_50Záp!H15=\"\",\"\",SeniorkyU_50Záp!H15)","v":""},{"$f":"IF(SeniorkyU_50Záp!I15=0,\"\",SeniorkyU_50Záp!I15)","v":""},{"$f":"SeniorkyU_50Záp!K15","v":"nie"}]
[null,"13.",{"$f":"IF(SeniorkyU_50Záp!C16=0,\"\",SeniorkyU_50Záp!C16)","v":""},{"$f":"IF(SeniorkyU_50Záp!D16=0,\"\",SeniorkyU_50Záp!D16)","v":""},{"$f":"IF(SeniorkyU_50Záp!E16=0,\"\",SeniorkyU_50Záp!E16)","v":""},{"$f":"IF(SeniorkyU_50Záp!F16=0,\"\",SeniorkyU_50Záp!F16)","v":""},{"$f":"IF(SeniorkyU_50Záp!G16=0,\"\",SeniorkyU_50Záp!G16)","v":""},{"$f":"IF(SeniorkyU_50Záp!H16=\"\",\"\",SeniorkyU_50Záp!H16)","v":""},{"$f":"IF(SeniorkyU_50Záp!I16=0,\"\",SeniorkyU_50Záp!I16)","v":""},{"$f":"SeniorkyU_50Záp!K16","v":"nie"}]
[null,"14.",{"$f":"IF(SeniorkyU_50Záp!C17=0,\"\",SeniorkyU_50Záp!C17)","v":""},{"$f":"IF(SeniorkyU_50Záp!D17=0,\"\",SeniorkyU_50Záp!D17)","v":""},{"$f":"IF(SeniorkyU_50Záp!E17=0,\"\",SeniorkyU_50Záp!E17)","v":""},{"$f":"IF(SeniorkyU_50Záp!F17=0,\"\",SeniorkyU_50Záp!F17)","v":""},{"$f":"IF(SeniorkyU_50Záp!G17=0,\"\",SeniorkyU_50Záp!G17)","v":""},{"$f":"IF(SeniorkyU_50Záp!H17=\"\",\"\",SeniorkyU_50Záp!H17)","v":""},{"$f":"IF(SeniorkyU_50Záp!I17=0,\"\",SeniorkyU_50Záp!I17)","v":""},{"$f":"SeniorkyU_50Záp!K17","v":"nie"}]
[null,"15.",{"$f":"IF(SeniorkyU_50Záp!C18=0,\"\",SeniorkyU_50Záp!C18)","v":""},{"$f":"IF(SeniorkyU_50Záp!D18=0,\"\",SeniorkyU_50Záp!D18)","v":""},{"$f":"IF(SeniorkyU_50Záp!E18=0,\"\",SeniorkyU_50Záp!E18)","v":""},{"$f":"IF(SeniorkyU_50Záp!F18=0,\"\",SeniorkyU_50Záp!F18)","v":""},{"$f":"IF(SeniorkyU_50Záp!G18=0,\"\",SeniorkyU_50Záp!G18)","v":""},{"$f":"IF(SeniorkyU_50Záp!H18=\"\",\"\",SeniorkyU_50Záp!H18)","v":""},{"$f":"IF(SeniorkyU_50Záp!I18=0,\"\",SeniorkyU_50Záp!I18)","v":""},{"$f":"SeniorkyU_50Záp!K18","v":"nie"}]
[null,"16.",{"$f":"IF(SeniorkyU_50Záp!C19=0,\"\",SeniorkyU_50Záp!C19)","v":""},{"$f":"IF(SeniorkyU_50Záp!D19=0,\"\",SeniorkyU_50Záp!D19)","v":""},{"$f":"IF(SeniorkyU_50Záp!E19=0,\"\",SeniorkyU_50Záp!E19)","v":""},{"$f":"IF(SeniorkyU_50Záp!F19=0,\"\",SeniorkyU_50Záp!F19)","v":""},{"$f":"IF(SeniorkyU_50Záp!G19=0,\"\",SeniorkyU_50Záp!G19)","v":""},{"$f":"IF(SeniorkyU_50Záp!H19=\"\",\"\",SeniorkyU_50Záp!H19)","v":""},{"$f":"IF(SeniorkyU_50Záp!I19=0,\"\",SeniorkyU_50Záp!I19)","v":""},{"$f":"SeniorkyU_50Záp!K19","v":"nie"}]
[null,"17.",{"$f":"IF(SeniorkyU_50Záp!C20=0,\"\",SeniorkyU_50Záp!C20)","v":""},{"$f":"IF(SeniorkyU_50Záp!D20=0,\"\",SeniorkyU_50Záp!D20)","v":""},{"$f":"IF(SeniorkyU_50Záp!E20=0,\"\",SeniorkyU_50Záp!E20)","v":""},{"$f":"IF(SeniorkyU_50Záp!F20=0,\"\",SeniorkyU_50Záp!F20)","v":""},{"$f":"IF(SeniorkyU_50Záp!G20=0,\"\",SeniorkyU_50Záp!G20)","v":""},{"$f":"IF(SeniorkyU_50Záp!H20=\"\",\"\",SeniorkyU_50Záp!H20)","v":""},{"$f":"IF(SeniorkyU_50Záp!I20=0,\"\",SeniorkyU_50Záp!I20)","v":""},{"$f":"SeniorkyU_50Záp!K20","v":"nie"}]
[null,"18.",{"$f":"IF(SeniorkyU_50Záp!C21=0,\"\",SeniorkyU_50Záp!C21)","v":""},{"$f":"IF(SeniorkyU_50Záp!D21=0,\"\",SeniorkyU_50Záp!D21)","v":""},{"$f":"IF(SeniorkyU_50Záp!E21=0,\"\",SeniorkyU_50Záp!E21)","v":""},{"$f":"IF(SeniorkyU_50Záp!F21=0,\"\",SeniorkyU_50Záp!F21)","v":""},{"$f":"IF(SeniorkyU_50Záp!G21=0,\"\",SeniorkyU_50Záp!G21)","v":""},{"$f":"IF(SeniorkyU_50Záp!H21=\"\",\"\",SeniorkyU_50Záp!H21)","v":""},{"$f":"IF(SeniorkyU_50Záp!I21=0,\"\",SeniorkyU_50Záp!I21)","v":""},{"$f":"SeniorkyU_50Záp!K21","v":"nie"}]
[null,"19.",{"$f":"IF(SeniorkyU_50Záp!C22=0,\"\",SeniorkyU_50Záp!C22)","v":""},{"$f":"IF(SeniorkyU_50Záp!D22=0,\"\",SeniorkyU_50Záp!D22)","v":""},{"$f":"IF(SeniorkyU_50Záp!E22=0,\"\",SeniorkyU_50Záp!E22)","v":""},{"$f":"IF(SeniorkyU_50Záp!F22=0,\"\",SeniorkyU_50Záp!F22)","v":""},{"$f":"IF(SeniorkyU_50Záp!G22=0,\"\",SeniorkyU_50Záp!G22)","v":""},{"$f":"IF(SeniorkyU_50Záp!H22=\"\",\"\",SeniorkyU_50Záp!H22)","v":""},{"$f":"IF(SeniorkyU_50Záp!I22=0,\"\",SeniorkyU_50Záp!I22)","v":""},{"$f":"SeniorkyU_50Záp!K22","v":"nie"}]
[null,"20.",{"$f":"IF(SeniorkyU_50Záp!C23=0,\"\",SeniorkyU_50Záp!C23)","v":""},{"$f":"IF(SeniorkyU_50Záp!D23=0,\"\",SeniorkyU_50Záp!D23)","v":""},{"$f":"IF(SeniorkyU_50Záp!E23=0,\"\",SeniorkyU_50Záp!E23)","v":""},{"$f":"IF(SeniorkyU_50Záp!F23=0,\"\",SeniorkyU_50Záp!F23)","v":""},{"$f":"IF(SeniorkyU_50Záp!G23=0,\"\",SeniorkyU_50Záp!G23)","v":""},{"$f":"IF(SeniorkyU_50Záp!H23=\"\",\"\",SeniorkyU_50Záp!H23)","v":""},{"$f":"IF(SeniorkyU_50Záp!I23=0,\"\",SeniorkyU_50Záp!I23)","v":""},{"$f":"SeniorkyU_50Záp!K23","v":"nie"}]
[null,"21.",{"$f":"IF(SeniorkyU_50Záp!C24=0,\"\",SeniorkyU_50Záp!C24)","v":""},{"$f":"IF(SeniorkyU_50Záp!D24=0,\"\",SeniorkyU_50Záp!D24)","v":""},{"$f":"IF(SeniorkyU_50Záp!E24=0,\"\",SeniorkyU_50Záp!E24)","v":""},{"$f":"IF(SeniorkyU_50Záp!F24=0,\"\",SeniorkyU_50Záp!F24)","v":""},{"$f":"IF(SeniorkyU_50Záp!G24=0,\"\",SeniorkyU_50Záp!G24)","v":""},{"$f":"IF(SeniorkyU_50Záp!H24=\"\",\"\",SeniorkyU_50Záp!H24)","v":""},{"$f":"IF(SeniorkyU_50Záp!I24=0,\"\",SeniorkyU_50Záp!I24)","v":""},{"$f":"SeniorkyU_50Záp!K24","v":"nie"}]
[null,"22.",{"$f":"IF(SeniorkyU_50Záp!C25=0,\"\",SeniorkyU_50Záp!C25)","v":""},{"$f":"IF(SeniorkyU_50Záp!D25=0,\"\",SeniorkyU_50Záp!D25)","v":""},{"$f":"IF(SeniorkyU_50Záp!E25=0,\"\",SeniorkyU_50Záp!E25)","v":""},{"$f":"IF(SeniorkyU_50Záp!F25=0,\"\",SeniorkyU_50Záp!F25)","v":""},{"$f":"IF(SeniorkyU_50Záp!G25=0,\"\",SeniorkyU_50Záp!G25)","v":""},{"$f":"IF(SeniorkyU_50Záp!H25=\"\",\"\",SeniorkyU_50Záp!H25)","v":""},{"$f":"IF(SeniorkyU_50Záp!I25=0,\"\",SeniorkyU_50Záp!I25)","v":""},{"$f":"SeniorkyU_50Záp!K25","v":"nie"}]
[null,"23.",{"$f":"IF(SeniorkyU_50Záp!C26=0,\"\",SeniorkyU_50Záp!C26)","v":""},{"$f":"IF(SeniorkyU_50Záp!D26=0,\"\",SeniorkyU_50Záp!D26)","v":""},{"$f":"IF(SeniorkyU_50Záp!E26=0,\"\",SeniorkyU_50Záp!E26)","v":""},{"$f":"IF(SeniorkyU_50Záp!F26=0,\"\",SeniorkyU_50Záp!F26)","v":""},{"$f":"IF(SeniorkyU_50Záp!G26=0,\"\",SeniorkyU_50Záp!G26)","v":""},{"$f":"IF(SeniorkyU_50Záp!H26=\"\",\"\",SeniorkyU_50Záp!H26)","v":""},{"$f":"IF(SeniorkyU_50Záp!I26=0,\"\",SeniorkyU_50Záp!I26)","v":""},{"$f":"SeniorkyU_50Záp!K26","v":"nie"}]
[null,"24.",{"$f":"IF(SeniorkyU_50Záp!C27=0,\"\",SeniorkyU_50Záp!C27)","v":""},{"$f":"IF(SeniorkyU_50Záp!D27=0,\"\",SeniorkyU_50Záp!D27)","v":""},{"$f":"IF(SeniorkyU_50Záp!E27=0,\"\",SeniorkyU_50Záp!E27)","v":""},{"$f":"IF(SeniorkyU_50Záp!F27=0,\"\",SeniorkyU_50Záp!F27)","v":""},{"$f":"IF(SeniorkyU_50Záp!G27=0,\"\",SeniorkyU_50Záp!G27)","v":""},{"$f":"IF(SeniorkyU_50Záp!H27=\"\",\"\",SeniorkyU_50Záp!H27)","v":""},{"$f":"IF(SeniorkyU_50Záp!I27=0,\"\",SeniorkyU_50Záp!I27)","v":""},{"$f":"SeniorkyU_50Záp!K27","v":"nie"}]
[null,"25.",{"$f":"IF(SeniorkyU_50Záp!C28=0,\"\",SeniorkyU_50Záp!C28)","v":""},{"$f":"IF(SeniorkyU_50Záp!D28=0,\"\",SeniorkyU_50Záp!D28)","v":""},{"$f":"IF(SeniorkyU_50Záp!E28=0,\"\",SeniorkyU_50Záp!E28)","v":""},{"$f":"IF(SeniorkyU_50Záp!F28=0,\"\",SeniorkyU_50Záp!F28)","v":""},{"$f":"IF(SeniorkyU_50Záp!G28=0,\"\",SeniorkyU_50Záp!G28)","v":""},{"$f":"IF(SeniorkyU_50Záp!H28=\"\",\"\",SeniorkyU_50Záp!H28)","v":""},{"$f":"IF(SeniorkyU_50Záp!I28=0,\"\",SeniorkyU_50Záp!I28)","v":""},{"$f":"SeniorkyU_50Záp!K28","v":"nie"}]
[null,"26.",{"$f":"IF(SeniorkyU_50Záp!C29=0,\"\",SeniorkyU_50Záp!C29)","v":""},{"$f":"IF(SeniorkyU_50Záp!D29=0,\"\",SeniorkyU_50Záp!D29)","v":""},{"$f":"IF(SeniorkyU_50Záp!E29=0,\"\",SeniorkyU_50Záp!E29)","v":""},{"$f":"IF(SeniorkyU_50Záp!F29=0,\"\",SeniorkyU_50Záp!F29)","v":""},{"$f":"IF(SeniorkyU_50Záp!G29=0,\"\",SeniorkyU_50Záp!G29)","v":""},{"$f":"IF(SeniorkyU_50Záp!H29=\"\",\"\",SeniorkyU_50Záp!H29)","v":""},{"$f":"IF(SeniorkyU_50Záp!I29=0,\"\",SeniorkyU_50Záp!I29)","v":""},{"$f":"SeniorkyU_50Záp!K29","v":"nie"}]
[null,"27.",{"$f":"IF(SeniorkyU_50Záp!C30=0,\"\",SeniorkyU_50Záp!C30)","v":""},{"$f":"IF(SeniorkyU_50Záp!D30=0,\"\",SeniorkyU_50Záp!D30)","v":""},{"$f":"IF(SeniorkyU_50Záp!E30=0,\"\",SeniorkyU_50Záp!E30)","v":""},{"$f":"IF(SeniorkyU_50Záp!F30=0,\"\",SeniorkyU_50Záp!F30)","v":""},{"$f":"IF(SeniorkyU_50Záp!G30=0,\"\",SeniorkyU_50Záp!G30)","v":""},{"$f":"IF(SeniorkyU_50Záp!H30=\"\",\"\",SeniorkyU_50Záp!H30)","v":""},{"$f":"IF(SeniorkyU_50Záp!I30=0,\"\",SeniorkyU_50Záp!I30)","v":""},{"$f":"SeniorkyU_50Záp!K30","v":"nie"}]
[null,"28.",{"$f":"IF(SeniorkyU_50Záp!C31=0,\"\",SeniorkyU_50Záp!C31)","v":""},{"$f":"IF(SeniorkyU_50Záp!D31=0,\"\",SeniorkyU_50Záp!D31)","v":""},{"$f":"IF(SeniorkyU_50Záp!E31=0,\"\",SeniorkyU_50Záp!E31)","v":""},{"$f":"IF(SeniorkyU_50Záp!F31=0,\"\",SeniorkyU_50Záp!F31)","v":""},{"$f":"IF(SeniorkyU_50Záp!G31=0,\"\",SeniorkyU_50Záp!G31)","v":""},{"$f":"IF(SeniorkyU_50Záp!H31=\"\",\"\",SeniorkyU_50Záp!H31)","v":""},{"$f":"IF(SeniorkyU_50Záp!I31=0,\"\",SeniorkyU_50Záp!I31)","v":""},{"$f":"SeniorkyU_50Záp!K31","v":"nie"}]
[null,"29.",{"$f":"IF(SeniorkyU_50Záp!C32=0,\"\",SeniorkyU_50Záp!C32)","v":""},{"$f":"IF(SeniorkyU_50Záp!D32=0,\"\",SeniorkyU_50Záp!D32)","v":""},{"$f":"IF(SeniorkyU_50Záp!E32=0,\"\",SeniorkyU_50Záp!E32)","v":""},{"$f":"IF(SeniorkyU_50Záp!F32=0,\"\",SeniorkyU_50Záp!F32)","v":""},{"$f":"IF(SeniorkyU_50Záp!G32=0,\"\",SeniorkyU_50Záp!G32)","v":""},{"$f":"IF(SeniorkyU_50Záp!H32=\"\",\"\",SeniorkyU_50Záp!H32)","v":""},{"$f":"IF(SeniorkyU_50Záp!I32=0,\"\",SeniorkyU_50Záp!I32)","v":""},{"$f":"SeniorkyU_50Záp!K32","v":"nie"}]
[null,"30.",{"$f":"IF(SeniorkyU_50Záp!C33=0,\"\",SeniorkyU_50Záp!C33)","v":""},{"$f":"IF(SeniorkyU_50Záp!D33=0,\"\",SeniorkyU_50Záp!D33)","v":""},{"$f":"IF(SeniorkyU_50Záp!E33=0,\"\",SeniorkyU_50Záp!E33)","v":""},{"$f":"IF(SeniorkyU_50Záp!F33=0,\"\",SeniorkyU_50Záp!F33)","v":""},{"$f":"IF(SeniorkyU_50Záp!G33=0,\"\",SeniorkyU_50Záp!G33)","v":""},{"$f":"IF(SeniorkyU_50Záp!H33=\"\",\"\",SeniorkyU_50Záp!H33)","v":""},{"$f":"IF(SeniorkyU_50Záp!I33=0,\"\",SeniorkyU_50Záp!I33)","v":""},{"$f":"SeniorkyU_50Záp!K33","v":"nie"}]
[]
[null,"Kraj :",null,{"$f":"SenioriU_60Záp!$F$1","v":"Trenčiansky"},null,null,{"$f":"SenioriU_60Záp!$H$2","v":"27.1.2019"}]
[null,"MK seniorov U-60 2019",null,null,"Kolkáreň :",{"$f":"SenioriU_60Záp!$E$2","v":"Stará Turá"}]
[]
[null,"Por.","Hráči","Č.r.p.","Klub","Plné","Dorážka","Chyby","Spolu"]
[]
[null,"1.",{"$f":"IF(SenioriU_60Záp!C15=0,\"\",SenioriU_60Záp!C15)","v":"Maroň Ján"},{"$f":"IF(SenioriU_60Záp!D15=0,\"\",SenioriU_60Záp!D15)","v":7880},{"$f":"IF(SenioriU_60Záp!E15=0,\"\",SenioriU_60Záp!E15)","v":"MKK Stará Turá"},{"$f":"IF(SenioriU_60Záp!F15=0,\"\",SenioriU_60Záp!F15)","v":393},{"$f":"IF(SenioriU_60Záp!G15=0,\"\",SenioriU_60Záp!G15)","v":202},{"$f":"IF(SenioriU_60Záp!H15=0,\"\",SenioriU_60Záp!H15)","v":2},{"$f":"IF(SenioriU_60Záp!I15=0,\"\",SenioriU_60Záp!I15)","v":595},{"$f":"SenioriU_60Záp!K15","v":"áno"}]
[null,"2.",{"$f":"IF(SenioriU_60Záp!C21=0,\"\",SenioriU_60Záp!C21)","v":"Vojtáš Karol"},{"$f":"IF(SenioriU_60Záp!D21=0,\"\",SenioriU_60Záp!D21)","v":7971},{"$f":"IF(SenioriU_60Záp!E21=0,\"\",SenioriU_60Záp!E21)","v":"TKK Trenčín"},{"$f":"IF(SenioriU_60Záp!F21=0,\"\",SenioriU_60Záp!F21)","v":388},{"$f":"IF(SenioriU_60Záp!G21=0,\"\",SenioriU_60Záp!G21)","v":175},{"$f":"IF(SenioriU_60Záp!H21=0,\"\",SenioriU_60Záp!H21)","v":8},{"$f":"IF(SenioriU_60Záp!I21=0,\"\",SenioriU_60Záp!I21)","v":563},{"$f":"SenioriU_60Záp!K21","v":"áno"}]
[null,"3.",{"$f":"IF(SenioriU_60Záp!C12=0,\"\",SenioriU_60Záp!C12)","v":"Sitár Pavol"},{"$f":"IF(SenioriU_60Záp!D12=0,\"\",SenioriU_60Záp!D12)","v":8006},{"$f":"IF(SenioriU_60Záp!E12=0,\"\",SenioriU_60Záp!E12)","v":"KK Hustra Uhrovec"},{"$f":"IF(SenioriU_60Záp!F12=0,\"\",SenioriU_60Záp!F12)","v":378},{"$f":"IF(SenioriU_60Záp!G12=0,\"\",SenioriU_60Záp!G12)","v":182},{"$f":"IF(SenioriU_60Záp!H12=0,\"\",SenioriU_60Záp!H12)","v":4},{"$f":"IF(SenioriU_60Záp!I12=0,\"\",SenioriU_60Záp!I12)","v":560},{"$f":"SenioriU_60Záp!K12","v":"áno"}]
[null,"4.",{"$f":"IF(SenioriU_60Záp!C14=0,\"\",SenioriU_60Záp!C14)","v":"Šupík Michal"},{"$f":"IF(SenioriU_60Záp!D14=0,\"\",SenioriU_60Záp!D14)","v":1006},{"$f":"IF(SenioriU_60Záp!E14=0,\"\",SenioriU_60Záp!E14)","v":"MKK Stará Turá"},{"$f":"IF(SenioriU_60Záp!F14=0,\"\",SenioriU_60Záp!F14)","v":389},{"$f":"IF(SenioriU_60Záp!G14=0,\"\",SenioriU_60Záp!G14)","v":158},{"$f":"IF(SenioriU_60Záp!H14=0,\"\",SenioriU_60Záp!H14)","v":7},{"$f":"IF(SenioriU_60Záp!I14=0,\"\",SenioriU_60Záp!I14)","v":547},{"$f":"SenioriU_60Záp!K14","v":"áno"}]
[null,"5.",{"$f":"IF(SenioriU_60Záp!C20=0,\"\",SenioriU_60Záp!C20)","v":"Porubský Miroslav"},{"$f":"IF(SenioriU_60Záp!D20=0,\"\",SenioriU_60Záp!D20)","v":7965},{"$f":"IF(SenioriU_60Záp!E20=0,\"\",SenioriU_60Záp!E20)","v":"TKK Trenčín"},{"$f":"IF(SenioriU_60Záp!F20=0,\"\",SenioriU_60Záp!F20)","v":365},{"$f":"IF(SenioriU_60Záp!G20=0,\"\",SenioriU_60Záp!G20)","v":181},{"$f":"IF(SenioriU_60Záp!H20=0,\"\",SenioriU_60Záp!H20)","v":7},{"$f":"IF(SenioriU_60Záp!I20=0,\"\",SenioriU_60Záp!I20)","v":546},{"$f":"SenioriU_60Záp!K20","v":"áno"}]
[null,"6.",{"$f":"IF(SenioriU_60Záp!C4=0,\"\",SenioriU_60Záp!C4)","v":"Ďuďák Pavol"},{"$f":"IF(SenioriU_60Záp!D4=0,\"\",SenioriU_60Záp!D4)","v":1399},{"$f":"IF(SenioriU_60Záp!E4=0,\"\",SenioriU_60Záp!E4)","v":"TKK Trenčín"},{"$f":"IF(SenioriU_60Záp!F4=0,\"\",SenioriU_60Záp!F4)","v":370},{"$f":"IF(SenioriU_60Záp!G4=0,\"\",SenioriU_60Záp!G4)","v":176},{"$f":"IF(SenioriU_60Záp!H4=0,\"\",SenioriU_60Záp!H4)","v":4},{"$f":"IF(SenioriU_60Záp!I4=0,\"\",SenioriU_60Záp!I4)","v":546},{"$f":"SenioriU_60Záp!K4","v":"áno"}]
[null,"7.",{"$f":"IF(SenioriU_60Záp!C18=0,\"\",SenioriU_60Záp!C18)","v":"Guštara Štefan"},{"$f":"IF(SenioriU_60Záp!D18=0,\"\",SenioriU_60Záp!D18)","v":7961},{"$f":"IF(SenioriU_60Záp!E18=0,\"\",SenioriU_60Záp!E18)","v":"TKK Trenčín"},{"$f":"IF(SenioriU_60Záp!F18=0,\"\",SenioriU_60Záp!F18)","v":357},{"$f":"IF(SenioriU_60Záp!G18=0,\"\",SenioriU_60Záp!G18)","v":179},{"$f":"IF(SenioriU_60Záp!H18=0,\"\",SenioriU_60Záp!H18)","v":6},{"$f":"IF(SenioriU_60Záp!I18=0,\"\",SenioriU_60Záp!I18)","v":536},{"$f":"SenioriU_60Záp!K18","v":"áno"}]
[null,"8.",{"$f":"IF(SenioriU_60Záp!C23=0,\"\",SenioriU_60Záp!C23)","v":"Bročko Július"},{"$f":"IF(SenioriU_60Záp!D23=0,\"\",SenioriU_60Záp!D23)","v":7987},{"$f":"IF(SenioriU_60Záp!E23=0,\"\",SenioriU_60Záp!E23)","v":"BKK Bánovce nad Bebravou"},{"$f":"IF(SenioriU_60Záp!F23=0,\"\",SenioriU_60Záp!F23)","v":364},{"$f":"IF(SenioriU_60Záp!G23=0,\"\",SenioriU_60Záp!G23)","v":165},{"$f":"IF(SenioriU_60Záp!H23=0,\"\",SenioriU_60Záp!H23)","v":8},{"$f":"IF(SenioriU_60Záp!I23=0,\"\",SenioriU_60Záp!I23)","v":529},{"$f":"SenioriU_60Záp!K23","v":"áno"}]
[null,"9.",{"$f":"IF(SenioriU_60Záp!C19=0,\"\",SenioriU_60Záp!C19)","v":"Vlčák Juraj"},{"$f":"IF(SenioriU_60Záp!D19=0,\"\",SenioriU_60Záp!D19)","v":7970},{"$f":"IF(SenioriU_60Záp!E19=0,\"\",SenioriU_60Záp!E19)","v":"TKK Trenčín"},{"$f":"IF(SenioriU_60Záp!F19=0,\"\",SenioriU_60Záp!F19)","v":341},{"$f":"IF(SenioriU_60Záp!G19=0,\"\",SenioriU_60Záp!G19)","v":185},{"$f":"IF(SenioriU_60Záp!H19=0,\"\",SenioriU_60Záp!H19)","v":8},{"$f":"IF(SenioriU_60Záp!I19=0,\"\",SenioriU_60Záp!I19)","v":526},{"$f":"SenioriU_60Záp!K19","v":"áno"}]
[null,"10.",{"$f":"IF(SenioriU_60Záp!C11=0,\"\",SenioriU_60Záp!C11)","v":"Danaj Vladimír"},{"$f":"IF(SenioriU_60Záp!D11=0,\"\",SenioriU_60Záp!D11)","v":8002},{"$f":"IF(SenioriU_60Záp!E11=0,\"\",SenioriU_60Záp!E11)","v":"KK Hustra Uhrovec"},{"$f":"IF(SenioriU_60Záp!F11=0,\"\",SenioriU_60Záp!F11)","v":365},{"$f":"IF(SenioriU_60Záp!G11=0,\"\",SenioriU_60Záp!G11)","v":157},{"$f":"IF(SenioriU_60Záp!H11=0,\"\",SenioriU_60Záp!H11)","v":16},{"$f":"IF(SenioriU_60Záp!I11=0,\"\",SenioriU_60Záp!I11)","v":522},{"$f":"SenioriU_60Záp!K11","v":"áno"}]
[null,"11.",{"$f":"IF(SenioriU_60Záp!C8=0,\"\",SenioriU_60Záp!C8)","v":"Vagovič Pavol"},{"$f":"IF(SenioriU_60Záp!D8=0,\"\",SenioriU_60Záp!D8)","v":7794},{"$f":"IF(SenioriU_60Záp!E8=0,\"\",SenioriU_60Záp!E8)","v":"KK Dubnica"},{"$f":"IF(SenioriU_60Záp!F8=0,\"\",SenioriU_60Záp!F8)","v":367},{"$f":"IF(SenioriU_60Záp!G8=0,\"\",SenioriU_60Záp!G8)","v":150},{"$f":"IF(SenioriU_60Záp!H8=0,\"\",SenioriU_60Záp!H8)","v":11},{"$f":"IF(SenioriU_60Záp!I8=0,\"\",SenioriU_60Záp!I8)","v":517},{"$f":"SenioriU_60Záp!K8","v":"áno"}]
[null,"12.",{"$f":"IF(SenioriU_60Záp!C26=0,\"\",SenioriU_60Záp!C26)","v":"Žitnaň Ivan"},{"$f":"IF(SenioriU_60Záp!D26=0,\"\",SenioriU_60Záp!D26)","v":7988},{"$f":"IF(SenioriU_60Záp!E26=0,\"\",SenioriU_60Záp!E26)","v":"BKK Bánovce nad Bebravou"},{"$f":"IF(SenioriU_60Záp!F26=0,\"\",SenioriU_60Záp!F26)","v":367},{"$f":"IF(SenioriU_60Záp!G26=0,\"\",SenioriU_60Záp!G26)","v":145},{"$f":"IF(SenioriU_60Záp!H26=0,\"\",SenioriU_60Záp!H26)","v":9},{"$f":"IF(SenioriU_60Záp!I26=0,\"\",SenioriU_60Záp!I26)","v":512},{"$f":"SenioriU_60Záp!K26","v":"áno"}]
[null,"13.",{"$f":"IF(SenioriU_60Záp!C9=0,\"\",SenioriU_60Záp!C9)","v":"Bača Jozef"},{"$f":"IF(SenioriU_60Záp!D9=0,\"\",SenioriU_60Záp!D9)","v":338},{"$f":"IF(SenioriU_60Záp!E9=0,\"\",SenioriU_60Záp!E9)","v":"DKK Nové Mesto n/V"},{"$f":"IF(SenioriU_60Záp!F9=0,\"\",SenioriU_60Záp!F9)","v":356},{"$f":"IF(SenioriU_60Záp!G9=0,\"\",SenioriU_60Záp!G9)","v":152},{"$f":"IF(SenioriU_60Záp!H9=0,\"\",SenioriU_60Záp!H9)","v":9},{"$f":"IF(SenioriU_60Záp!I9=0,\"\",SenioriU_60Záp!I9)","v":508},{"$f":"SenioriU_60Záp!K9","v":"áno"}]
[null,"14.",{"$f":"IF(SenioriU_60Záp!C17=0,\"\",SenioriU_60Záp!C17)","v":"Peško Juraj"},{"$f":"IF(SenioriU_60Záp!D17=0,\"\",SenioriU_60Záp!D17)","v":7765},{"$f":"IF(SenioriU_60Záp!E17=0,\"\",SenioriU_60Záp!E17)","v":"MKK Stará Turá"},{"$f":"IF(SenioriU_60Záp!F17=0,\"\",SenioriU_60Záp!F17)","v":377},{"$f":"IF(SenioriU_60Záp!G17=0,\"\",SenioriU_60Záp!G17)","v":129},{"$f":"IF(SenioriU_60Záp!H17=0,\"\",SenioriU_60Záp!H17)","v":18},{"$f":"IF(SenioriU_60Záp!I17=0,\"\",SenioriU_60Záp!I17)","v":506},{"$f":"SenioriU_60Záp!K17","v":"áno"}]
[null,"15.",{"$f":"IF(SenioriU_60Záp!C25=0,\"\",SenioriU_60Záp!C25)","v":"Pristač Anton"},{"$f":"IF(SenioriU_60Záp!D25=0,\"\",SenioriU_60Záp!D25)","v":552},{"$f":"IF(SenioriU_60Záp!E25=0,\"\",SenioriU_60Záp!E25)","v":"BKK Bánovce nad Bebravou"},{"$f":"IF(SenioriU_60Záp!F25=0,\"\",SenioriU_60Záp!F25)","v":344},{"$f":"IF(SenioriU_60Záp!G25=0,\"\",SenioriU_60Záp!G25)","v":156},{"$f":"IF(SenioriU_60Záp!H25=0,\"\",SenioriU_60Záp!H25)","v":10},{"$f":"IF(SenioriU_60Záp!I25=0,\"\",SenioriU_60Záp!I25)","v":500},{"$f":"SenioriU_60Záp!K25","v":"áno"}]
[null,"16.",{"$f":"IF(SenioriU_60Záp!C10=0,\"\",SenioriU_60Záp!C10)","v":"Galis Dušan"},{"$f":"IF(SenioriU_60Záp!D10=0,\"\",SenioriU_60Záp!D10)","v":8003},{"$f":"IF(SenioriU_60Záp!E10=0,\"\",SenioriU_60Záp!E10)","v":"KK Hustra Uhrovec"},{"$f":"IF(SenioriU_60Záp!F10=0,\"\",SenioriU_60Záp!F10)","v":341},{"$f":"IF(SenioriU_60Záp!G10=0,\"\",SenioriU_60Záp!G10)","v":149},{"$f":"IF(SenioriU_60Záp!H10=0,\"\",SenioriU_60Záp!H10)","v":12},{"$f":"IF(SenioriU_60Záp!I10=0,\"\",SenioriU_60Záp!I10)","v":490},{"$f":"SenioriU_60Záp!K10","v":"áno"}]
[null,"17.",{"$f":"IF(SenioriU_60Záp!C22=0,\"\",SenioriU_60Záp!C22)","v":"Breuer Karol"},{"$f":"IF(SenioriU_60Záp!D22=0,\"\",SenioriU_60Záp!D22)","v":8148},{"$f":"IF(SenioriU_60Záp!E22=0,\"\",SenioriU_60Záp!E22)","v":"TKK Trenčín"},{"$f":"IF(SenioriU_60Záp!F22=0,\"\",SenioriU_60Záp!F22)","v":328},{"$f":"IF(SenioriU_60Záp!G22=0,\"\",SenioriU_60Záp!G22)","v":154},{"$f":"IF(SenioriU_60Záp!H22=0,\"\",SenioriU_60Záp!H22)","v":12},{"$f":"IF(SenioriU_60Záp!I22=0,\"\",SenioriU_60Záp!I22)","v":482},{"$f":"SenioriU_60Záp!K22","v":"áno"}]
[null,"18.",{"$f":"IF(SenioriU_60Záp!C24=0,\"\",SenioriU_60Záp!C24)","v":"Šujan Anton"},{"$f":"IF(SenioriU_60Záp!D24=0,\"\",SenioriU_60Záp!D24)","v":1438},{"$f":"IF(SenioriU_60Záp!E24=0,\"\",SenioriU_60Záp!E24)","v":"BKK Bánovce nad Bebravou"},{"$f":"IF(SenioriU_60Záp!F24=0,\"\",SenioriU_60Záp!F24)","v":356},{"$f":"IF(SenioriU_60Záp!G24=0,\"\",SenioriU_60Záp!G24)","v":122},{"$f":"IF(SenioriU_60Záp!H24=0,\"\",SenioriU_60Záp!H24)","v":17},{"$f":"IF(SenioriU_60Záp!I24=0,\"\",SenioriU_60Záp!I24)","v":478},{"$f":"SenioriU_60Záp!K24","v":"áno"}]
[null,"19.",{"$f":"IF(SenioriU_60Záp!C5=0,\"\",SenioriU_60Záp!C5)","v":"Tomat Peter"},{"$f":"IF(SenioriU_60Záp!D5=0,\"\",SenioriU_60Záp!D5)","v":7966},{"$f":"IF(SenioriU_60Záp!E5=0,\"\",SenioriU_60Záp!E5)","v":"TKK Trenčín"},{"$f":"IF(SenioriU_60Záp!F5=0,\"\",SenioriU_60Záp!F5)","v":358},{"$f":"IF(SenioriU_60Záp!G5=0,\"\",SenioriU_60Záp!G5)","v":119},{"$f":"IF(SenioriU_60Záp!H5=0,\"\",SenioriU_60Záp!H5)","v":19},{"$f":"IF(SenioriU_60Záp!I5=0,\"\",SenioriU_60Záp!I5)","v":477},{"$f":"SenioriU_60Záp!K5","v":"áno"}]
[null,"20.",{"$f":"IF(SenioriU_60Záp!C7=0,\"\",SenioriU_60Záp!C7)","v":"Kebísek Ján"},{"$f":"IF(SenioriU_60Záp!D7=0,\"\",SenioriU_60Záp!D7)","v":7982},{"$f":"IF(SenioriU_60Záp!E7=0,\"\",SenioriU_60Záp!E7)","v":"KK Dubnica"},{"$f":"IF(SenioriU_60Záp!F7=0,\"\",SenioriU_60Záp!F7)","v":343},{"$f":"IF(SenioriU_60Záp!G7=0,\"\",SenioriU_60Záp!G7)","v":127},{"$f":"IF(SenioriU_60Záp!H7=0,\"\",SenioriU_60Záp!H7)","v":12},{"$f":"IF(SenioriU_60Záp!I7=0,\"\",SenioriU_60Záp!I7)","v":470},{"$f":"SenioriU_60Záp!K7","v":"áno"}]
[null,"21.",{"$f":"IF(SenioriU_60Záp!C6=0,\"\",SenioriU_60Záp!C6)","v":"Maschke Vladimír"},{"$f":"IF(SenioriU_60Záp!D6=0,\"\",SenioriU_60Záp!D6)","v":7962},{"$f":"IF(SenioriU_60Záp!E6=0,\"\",SenioriU_60Záp!E6)","v":"TKK Trenčín"},{"$f":"IF(SenioriU_60Záp!F6=0,\"\",SenioriU_60Záp!F6)","v":321},{"$f":"IF(SenioriU_60Záp!G6=0,\"\",SenioriU_60Záp!G6)","v":138},{"$f":"IF(SenioriU_60Záp!H6=0,\"\",SenioriU_60Záp!H6)","v":18},{"$f":"IF(SenioriU_60Záp!I6=0,\"\",SenioriU_60Záp!I6)","v":459},{"$f":"SenioriU_60Záp!K6","v":"áno"}]
[null,"22.",{"$f":"IF(SenioriU_60Záp!C16=0,\"\",SenioriU_60Záp!C16)","v":"Solovič Ján"},{"$f":"IF(SenioriU_60Záp!D16=0,\"\",SenioriU_60Záp!D16)","v":8114},{"$f":"IF(SenioriU_60Záp!E16=0,\"\",SenioriU_60Záp!E16)","v":"MKK Stará Turá"},{"$f":"IF(SenioriU_60Záp!F16=0,\"\",SenioriU_60Záp!F16)","v":333},{"$f":"IF(SenioriU_60Záp!G16=0,\"\",SenioriU_60Záp!G16)","v":124},{"$f":"IF(SenioriU_60Záp!H16=0,\"\",SenioriU_60Záp!H16)","v":18},{"$f":"IF(SenioriU_60Záp!I16=0,\"\",SenioriU_60Záp!I16)","v":457},{"$f":"SenioriU_60Záp!K16","v":"áno"}]
[null,"23.",{"$f":"IF(SenioriU_60Záp!C13=0,\"\",SenioriU_60Záp!C13)","v":"Lukáč Svätoslav"},{"$f":"IF(SenioriU_60Záp!D13=0,\"\",SenioriU_60Záp!D13)","v":8116},{"$f":"IF(SenioriU_60Záp!E13=0,\"\",SenioriU_60Záp!E13)","v":"MKK Stará Turá"},{"$f":"IF(SenioriU_60Záp!F13=0,\"\",SenioriU_60Záp!F13)","v":350},{"$f":"IF(SenioriU_60Záp!G13=0,\"\",SenioriU_60Záp!G13)","v":97},{"$f":"IF(SenioriU_60Záp!H13=0,\"\",SenioriU_60Záp!H13)","v":24},{"$f":"IF(SenioriU_60Záp!I13=0,\"\",SenioriU_60Záp!I13)","v":447},{"$f":"SenioriU_60Záp!K13","v":"áno"}]
[null,"24.",{"$f":"IF(SenioriU_60Záp!C27=0,\"\",SenioriU_60Záp!C27)","v":"Tóth Viktor"},{"$f":"IF(SenioriU_60Záp!D27=0,\"\",SenioriU_60Záp!D27)","v":1219},{"$f":"IF(SenioriU_60Záp!E27=0,\"\",SenioriU_60Záp!E27)","v":"BKK Bánovce nad Bebravou"},{"$f":"IF(SenioriU_60Záp!F27=0,\"\",SenioriU_60Záp!F27)","v":296},{"$f":"IF(SenioriU_60Záp!G27=0,\"\",SenioriU_60Záp!G27)","v":64},{"$f":"IF(SenioriU_60Záp!H27=0,\"\",SenioriU_60Záp!H27)","v":31},{"$f":"IF(SenioriU_60Záp!I27=0,\"\",SenioriU_60Záp!I27)","v":360},{"$f":"SenioriU_60Záp!K27","v":"áno"}]
[null,"25.",{"$f":"IF(SenioriU_60Záp!C28=0,\"\",SenioriU_60Záp!C28)","v":""},{"$f":"IF(SenioriU_60Záp!D28=0,\"\",SenioriU_60Záp!D28)","v":""},{"$f":"IF(SenioriU_60Záp!E28=0,\"\",SenioriU_60Záp!E28)","v":""},{"$f":"IF(SenioriU_60Záp!F28=0,\"\",SenioriU_60Záp!F28)","v":""},{"$f":"IF(SenioriU_60Záp!G28=0,\"\",SenioriU_60Záp!G28)","v":""},{"$f":"IF(SenioriU_60Záp!H28=0,\"\",SenioriU_60Záp!H28)","v":""},{"$f":"IF(SenioriU_60Záp!I28=0,\"\",SenioriU_60Záp!I28)","v":""},{"$f":"SenioriU_60Záp!K28","v":"nie"}]
[null,"26.",{"$f":"IF(SenioriU_60Záp!C29=0,\"\",SenioriU_60Záp!C29)","v":""},{"$f":"IF(SenioriU_60Záp!D29=0,\"\",SenioriU_60Záp!D29)","v":""},{"$f":"IF(SenioriU_60Záp!E29=0,\"\",SenioriU_60Záp!E29)","v":""},{"$f":"IF(SenioriU_60Záp!F29=0,\"\",SenioriU_60Záp!F29)","v":""},{"$f":"IF(SenioriU_60Záp!G29=0,\"\",SenioriU_60Záp!G29)","v":""},{"$f":"IF(SenioriU_60Záp!H29=0,\"\",SenioriU_60Záp!H29)","v":""},{"$f":"IF(SenioriU_60Záp!I29=0,\"\",SenioriU_60Záp!I29)","v":""},{"$f":"SenioriU_60Záp!K29","v":"nie"}]
[null,"27.",{"$f":"IF(SenioriU_60Záp!C30=0,\"\",SenioriU_60Záp!C30)","v":""},{"$f":"IF(SenioriU_60Záp!D30=0,\"\",SenioriU_60Záp!D30)","v":""},{"$f":"IF(SenioriU_60Záp!E30=0,\"\",SenioriU_60Záp!E30)","v":""},{"$f":"IF(SenioriU_60Záp!F30=0,\"\",SenioriU_60Záp!F30)","v":""},{"$f":"IF(SenioriU_60Záp!G30=0,\"\",SenioriU_60Záp!G30)","v":""},{"$f":"IF(SenioriU_60Záp!H30=0,\"\",SenioriU_60Záp!H30)","v":""},{"$f":"IF(SenioriU_60Záp!I30=0,\"\",SenioriU_60Záp!I30)","v":""},{"$f":"SenioriU_60Záp!K30","v":"nie"}]
[null,"28.",{"$f":"IF(SenioriU_60Záp!C31=0,\"\",SenioriU_60Záp!C31)","v":""},{"$f":"IF(SenioriU_60Záp!D31=0,\"\",SenioriU_60Záp!D31)","v":""},{"$f":"IF(SenioriU_60Záp!E31=0,\"\",SenioriU_60Záp!E31)","v":""},{"$f":"IF(SenioriU_60Záp!F31=0,\"\",SenioriU_60Záp!F31)","v":""},{"$f":"IF(SenioriU_60Záp!G31=0,\"\",SenioriU_60Záp!G31)","v":""},{"$f":"IF(SenioriU_60Záp!H31=0,\"\",SenioriU_60Záp!H31)","v":""},{"$f":"IF(SenioriU_60Záp!I31=0,\"\",SenioriU_60Záp!I31)","v":""},{"$f":"SenioriU_60Záp!K31","v":"nie"}]
[null,"29.",{"$f":"IF(SenioriU_60Záp!C32=0,\"\",SenioriU_60Záp!C32)","v":""},{"$f":"IF(SenioriU_60Záp!D32=0,\"\",SenioriU_60Záp!D32)","v":""},{"$f":"IF(SenioriU_60Záp!E32=0,\"\",SenioriU_60Záp!E32)","v":""},{"$f":"IF(SenioriU_60Záp!F32=0,\"\",SenioriU_60Záp!F32)","v":""},{"$f":"IF(SenioriU_60Záp!G32=0,\"\",SenioriU_60Záp!G32)","v":""},{"$f":"IF(SenioriU_60Záp!H32=0,\"\",SenioriU_60Záp!H32)","v":""},{"$f":"IF(SenioriU_60Záp!I32=0,\"\",SenioriU_60Záp!I32)","v":""},{"$f":"SenioriU_60Záp!K32","v":"nie"}]
[null,"30.",{"$f":"IF(SenioriU_60Záp!C33=0,\"\",SenioriU_60Záp!C33)","v":""},{"$f":"IF(SenioriU_60Záp!D33=0,\"\",SenioriU_60Záp!D33)","v":""},{"$f":"IF(SenioriU_60Záp!E33=0,\"\",SenioriU_60Záp!E33)","v":""},{"$f":"IF(SenioriU_60Záp!F33=0,\"\",SenioriU_60Záp!F33)","v":""},{"$f":"IF(SenioriU_60Záp!G33=0,\"\",SenioriU_60Záp!G33)","v":""},{"$f":"IF(SenioriU_60Záp!H33=0,\"\",SenioriU_60Záp!H33)","v":""},{"$f":"IF(SenioriU_60Záp!I33=0,\"\",SenioriU_60Záp!I33)","v":""},{"$f":"SenioriU_60Záp!K33","v":"nie"}]
[null,"31.",{"$f":"IF(SenioriU_60Záp!C34=0,\"\",SenioriU_60Záp!C34)","v":""},{"$f":"IF(SenioriU_60Záp!D34=0,\"\",SenioriU_60Záp!D34)","v":""},{"$f":"IF(SenioriU_60Záp!E34=0,\"\",SenioriU_60Záp!E34)","v":""},{"$f":"IF(SenioriU_60Záp!F34=0,\"\",SenioriU_60Záp!F34)","v":""},{"$f":"IF(SenioriU_60Záp!G34=0,\"\",SenioriU_60Záp!G34)","v":""},{"$f":"IF(SenioriU_60Záp!H34=0,\"\",SenioriU_60Záp!H34)","v":""},{"$f":"IF(SenioriU_60Záp!I34=0,\"\",SenioriU_60Záp!I34)","v":""},{"$f":"SenioriU_60Záp!K34","v":"nie"}]
[null,"32.",{"$f":"IF(SenioriU_60Záp!C35=0,\"\",SenioriU_60Záp!C35)","v":""},{"$f":"IF(SenioriU_60Záp!D35=0,\"\",SenioriU_60Záp!D35)","v":""},{"$f":"IF(SenioriU_60Záp!E35=0,\"\",SenioriU_60Záp!E35)","v":""},{"$f":"IF(SenioriU_60Záp!F35=0,\"\",SenioriU_60Záp!F35)","v":""},{"$f":"IF(SenioriU_60Záp!G35=0,\"\",SenioriU_60Záp!G35)","v":""},{"$f":"IF(SenioriU_60Záp!H35=0,\"\",SenioriU_60Záp!H35)","v":""},{"$f":"IF(SenioriU_60Záp!I35=0,\"\",SenioriU_60Záp!I35)","v":""},{"$f":"SenioriU_60Záp!K35","v":"nie"}]
[null,"33.",{"$f":"IF(SenioriU_60Záp!C36=0,\"\",SenioriU_60Záp!C36)","v":""},{"$f":"IF(SenioriU_60Záp!D36=0,\"\",SenioriU_60Záp!D36)","v":""},{"$f":"IF(SenioriU_60Záp!E36=0,\"\",SenioriU_60Záp!E36)","v":""},{"$f":"IF(SenioriU_60Záp!F36=0,\"\",SenioriU_60Záp!F36)","v":""},{"$f":"IF(SenioriU_60Záp!G36=0,\"\",SenioriU_60Záp!G36)","v":""},{"$f":"IF(SenioriU_60Záp!H36=0,\"\",SenioriU_60Záp!H36)","v":""},{"$f":"IF(SenioriU_60Záp!I36=0,\"\",SenioriU_60Záp!I36)","v":""},{"$f":"SenioriU_60Záp!K36","v":"nie"}]
[null,"34.",{"$f":"IF(SenioriU_60Záp!C37=0,\"\",SenioriU_60Záp!C37)","v":""},{"$f":"IF(SenioriU_60Záp!D37=0,\"\",SenioriU_60Záp!D37)","v":""},{"$f":"IF(SenioriU_60Záp!E37=0,\"\",SenioriU_60Záp!E37)","v":""},{"$f":"IF(SenioriU_60Záp!F37=0,\"\",SenioriU_60Záp!F37)","v":""},{"$f":"IF(SenioriU_60Záp!G37=0,\"\",SenioriU_60Záp!G37)","v":""},{"$f":"IF(SenioriU_60Záp!H37=0,\"\",SenioriU_60Záp!H37)","v":""},{"$f":"IF(SenioriU_60Záp!I37=0,\"\",SenioriU_60Záp!I37)","v":""},{"$f":"SenioriU_60Záp!K37","v":"nie"}]
[null,"35.",{"$f":"IF(SenioriU_60Záp!C38=0,\"\",SenioriU_60Záp!C38)","v":""},{"$f":"IF(SenioriU_60Záp!D38=0,\"\",SenioriU_60Záp!D38)","v":""},{"$f":"IF(SenioriU_60Záp!E38=0,\"\",SenioriU_60Záp!E38)","v":""},{"$f":"IF(SenioriU_60Záp!F38=0,\"\",SenioriU_60Záp!F38)","v":""},{"$f":"IF(SenioriU_60Záp!G38=0,\"\",SenioriU_60Záp!G38)","v":""},{"$f":"IF(SenioriU_60Záp!H38=0,\"\",SenioriU_60Záp!H38)","v":""},{"$f":"IF(SenioriU_60Záp!I38=0,\"\",SenioriU_60Záp!I38)","v":""},{"$f":"SenioriU_60Záp!K38","v":"nie"}]
[null,"36.",{"$f":"IF(SenioriU_60Záp!C39=0,\"\",SenioriU_60Záp!C39)","v":""},{"$f":"IF(SenioriU_60Záp!D39=0,\"\",SenioriU_60Záp!D39)","v":""},{"$f":"IF(SenioriU_60Záp!E39=0,\"\",SenioriU_60Záp!E39)","v":""},{"$f":"IF(SenioriU_60Záp!F39=0,\"\",SenioriU_60Záp!F39)","v":""},{"$f":"IF(SenioriU_60Záp!G39=0,\"\",SenioriU_60Záp!G39)","v":""},{"$f":"IF(SenioriU_60Záp!H39=0,\"\",SenioriU_60Záp!H39)","v":""},{"$f":"IF(SenioriU_60Záp!I39=0,\"\",SenioriU_60Záp!I39)","v":""},{"$f":"SenioriU_60Záp!K39","v":"nie"}]
[null,"37.",{"$f":"IF(SenioriU_60Záp!C40=0,\"\",SenioriU_60Záp!C40)","v":""},{"$f":"IF(SenioriU_60Záp!D40=0,\"\",SenioriU_60Záp!D40)","v":""},{"$f":"IF(SenioriU_60Záp!E40=0,\"\",SenioriU_60Záp!E40)","v":""},{"$f":"IF(SenioriU_60Záp!F40=0,\"\",SenioriU_60Záp!F40)","v":""},{"$f":"IF(SenioriU_60Záp!G40=0,\"\",SenioriU_60Záp!G40)","v":""},{"$f":"IF(SenioriU_60Záp!H40=0,\"\",SenioriU_60Záp!H40)","v":""},{"$f":"IF(SenioriU_60Záp!I40=0,\"\",SenioriU_60Záp!I40)","v":""},{"$f":"SenioriU_60Záp!K40","v":"nie"}]
[null,"38.",{"$f":"IF(SenioriU_60Záp!C41=0,\"\",SenioriU_60Záp!C41)","v":""},{"$f":"IF(SenioriU_60Záp!D41=0,\"\",SenioriU_60Záp!D41)","v":""},{"$f":"IF(SenioriU_60Záp!E41=0,\"\",SenioriU_60Záp!E41)","v":""},{"$f":"IF(SenioriU_60Záp!F41=0,\"\",SenioriU_60Záp!F41)","v":""},{"$f":"IF(SenioriU_60Záp!G41=0,\"\",SenioriU_60Záp!G41)","v":""},{"$f":"IF(SenioriU_60Záp!H41=0,\"\",SenioriU_60Záp!H41)","v":""},{"$f":"IF(SenioriU_60Záp!I41=0,\"\",SenioriU_60Záp!I41)","v":""},{"$f":"SenioriU_60Záp!K41","v":"nie"}]
[null,"39.",{"$f":"IF(SenioriU_60Záp!C42=0,\"\",SenioriU_60Záp!C42)","v":""},{"$f":"IF(SenioriU_60Záp!D42=0,\"\",SenioriU_60Záp!D42)","v":""},{"$f":"IF(SenioriU_60Záp!E42=0,\"\",SenioriU_60Záp!E42)","v":""},{"$f":"IF(SenioriU_60Záp!F42=0,\"\",SenioriU_60Záp!F42)","v":""},{"$f":"IF(SenioriU_60Záp!G42=0,\"\",SenioriU_60Záp!G42)","v":""},{"$f":"IF(SenioriU_60Záp!H42=0,\"\",SenioriU_60Záp!H42)","v":""},{"$f":"IF(SenioriU_60Záp!I42=0,\"\",SenioriU_60Záp!I42)","v":""},{"$f":"SenioriU_60Záp!K42","v":"nie"}]
[null,"40.",{"$f":"IF(SenioriU_60Záp!C43=0,\"\",SenioriU_60Záp!C43)","v":""},{"$f":"IF(SenioriU_60Záp!D43=0,\"\",SenioriU_60Záp!D43)","v":""},{"$f":"IF(SenioriU_60Záp!E43=0,\"\",SenioriU_60Záp!E43)","v":""},{"$f":"IF(SenioriU_60Záp!F43=0,\"\",SenioriU_60Záp!F43)","v":""},{"$f":"IF(SenioriU_60Záp!G43=0,\"\",SenioriU_60Záp!G43)","v":""},{"$f":"IF(SenioriU_60Záp!H43=0,\"\",SenioriU_60Záp!H43)","v":""},{"$f":"IF(SenioriU_60Záp!I43=0,\"\",SenioriU_60Záp!I43)","v":""},{"$f":"SenioriU_60Záp!K43","v":"nie"}]
[null,"41.",{"$f":"IF(SenioriU_60Záp!C44=0,\"\",SenioriU_60Záp!C44)","v":""},{"$f":"IF(SenioriU_60Záp!D44=0,\"\",SenioriU_60Záp!D44)","v":""},{"$f":"IF(SenioriU_60Záp!E44=0,\"\",SenioriU_60Záp!E44)","v":""},{"$f":"IF(SenioriU_60Záp!F44=0,\"\",SenioriU_60Záp!F44)","v":""},{"$f":"IF(SenioriU_60Záp!G44=0,\"\",SenioriU_60Záp!G44)","v":""},{"$f":"IF(SenioriU_60Záp!H44=0,\"\",SenioriU_60Záp!H44)","v":""},{"$f":"IF(SenioriU_60Záp!I44=0,\"\",SenioriU_60Záp!I44)","v":""},{"$f":"SenioriU_60Záp!K44","v":"nie"}]
[null,"42.",{"$f":"IF(SenioriU_60Záp!C45=0,\"\",SenioriU_60Záp!C45)","v":""},{"$f":"IF(SenioriU_60Záp!D45=0,\"\",SenioriU_60Záp!D45)","v":""},{"$f":"IF(SenioriU_60Záp!E45=0,\"\",SenioriU_60Záp!E45)","v":""},{"$f":"IF(SenioriU_60Záp!F45=0,\"\",SenioriU_60Záp!F45)","v":""},{"$f":"IF(SenioriU_60Záp!G45=0,\"\",SenioriU_60Záp!G45)","v":""},{"$f":"IF(SenioriU_60Záp!H45=0,\"\",SenioriU_60Záp!H45)","v":""},{"$f":"IF(SenioriU_60Záp!I45=0,\"\",SenioriU_60Záp!I45)","v":""},{"$f":"SenioriU_60Záp!K45","v":"nie"}]
[null,"43.",{"$f":"IF(SenioriU_60Záp!C46=0,\"\",SenioriU_60Záp!C46)","v":""},{"$f":"IF(SenioriU_60Záp!D46=0,\"\",SenioriU_60Záp!D46)","v":""},{"$f":"IF(SenioriU_60Záp!E46=0,\"\",SenioriU_60Záp!E46)","v":""},{"$f":"IF(SenioriU_60Záp!F46=0,\"\",SenioriU_60Záp!F46)","v":""},{"$f":"IF(SenioriU_60Záp!G46=0,\"\",SenioriU_60Záp!G46)","v":""},{"$f":"IF(SenioriU_60Záp!H46=0,\"\",SenioriU_60Záp!H46)","v":""},{"$f":"IF(SenioriU_60Záp!I46=0,\"\",SenioriU_60Záp!I46)","v":""},{"$f":"SenioriU_60Záp!K46","v":"nie"}]
[null,"44.",{"$f":"IF(SenioriU_60Záp!C47=0,\"\",SenioriU_60Záp!C47)","v":""},{"$f":"IF(SenioriU_60Záp!D47=0,\"\",SenioriU_60Záp!D47)","v":""},{"$f":"IF(SenioriU_60Záp!E47=0,\"\",SenioriU_60Záp!E47)","v":""},{"$f":"IF(SenioriU_60Záp!F47=0,\"\",SenioriU_60Záp!F47)","v":""},{"$f":"IF(SenioriU_60Záp!G47=0,\"\",SenioriU_60Záp!G47)","v":""},{"$f":"IF(SenioriU_60Záp!H47=0,\"\",SenioriU_60Záp!H47)","v":""},{"$f":"IF(SenioriU_60Záp!I47=0,\"\",SenioriU_60Záp!I47)","v":""},{"$f":"SenioriU_60Záp!K47","v":"nie"}]
[null,"45.",{"$f":"IF(SenioriU_60Záp!C48=0,\"\",SenioriU_60Záp!C48)","v":""},{"$f":"IF(SenioriU_60Záp!D48=0,\"\",SenioriU_60Záp!D48)","v":""},{"$f":"IF(SenioriU_60Záp!E48=0,\"\",SenioriU_60Záp!E48)","v":""},{"$f":"IF(SenioriU_60Záp!F48=0,\"\",SenioriU_60Záp!F48)","v":""},{"$f":"IF(SenioriU_60Záp!G48=0,\"\",SenioriU_60Záp!G48)","v":""},{"$f":"IF(SenioriU_60Záp!H48=0,\"\",SenioriU_60Záp!H48)","v":""},{"$f":"IF(SenioriU_60Záp!I48=0,\"\",SenioriU_60Záp!I48)","v":""},{"$f":"SenioriU_60Záp!K48","v":"nie"}]
[null,"46.",{"$f":"IF(SenioriU_60Záp!C49=0,\"\",SenioriU_60Záp!C49)","v":""},{"$f":"IF(SenioriU_60Záp!D49=0,\"\",SenioriU_60Záp!D49)","v":""},{"$f":"IF(SenioriU_60Záp!E49=0,\"\",SenioriU_60Záp!E49)","v":""},{"$f":"IF(SenioriU_60Záp!F49=0,\"\",SenioriU_60Záp!F49)","v":""},{"$f":"IF(SenioriU_60Záp!G49=0,\"\",SenioriU_60Záp!G49)","v":""},{"$f":"IF(SenioriU_60Záp!H49=0,\"\",SenioriU_60Záp!H49)","v":""},{"$f":"IF(SenioriU_60Záp!I49=0,\"\",SenioriU_60Záp!I49)","v":""},{"$f":"SenioriU_60Záp!K49","v":"nie"}]
[null,"47.",{"$f":"IF(SenioriU_60Záp!C50=0,\"\",SenioriU_60Záp!C50)","v":""},{"$f":"IF(SenioriU_60Záp!D50=0,\"\",SenioriU_60Záp!D50)","v":""},{"$f":"IF(SenioriU_60Záp!E50=0,\"\",SenioriU_60Záp!E50)","v":""},{"$f":"IF(SenioriU_60Záp!F50=0,\"\",SenioriU_60Záp!F50)","v":""},{"$f":"IF(SenioriU_60Záp!G50=0,\"\",SenioriU_60Záp!G50)","v":""},{"$f":"IF(SenioriU_60Záp!H50=0,\"\",SenioriU_60Záp!H50)","v":""},{"$f":"IF(SenioriU_60Záp!I50=0,\"\",SenioriU_60Záp!I50)","v":""},{"$f":"SenioriU_60Záp!K50","v":"nie"}]
[null,"48.",{"$f":"IF(SenioriU_60Záp!C51=0,\"\",SenioriU_60Záp!C51)","v":""},{"$f":"IF(SenioriU_60Záp!D51=0,\"\",SenioriU_60Záp!D51)","v":""},{"$f":"IF(SenioriU_60Záp!E51=0,\"\",SenioriU_60Záp!E51)","v":""},{"$f":"IF(SenioriU_60Záp!F51=0,\"\",SenioriU_60Záp!F51)","v":""},{"$f":"IF(SenioriU_60Záp!G51=0,\"\",SenioriU_60Záp!G51)","v":""},{"$f":"IF(SenioriU_60Záp!H51=0,\"\",SenioriU_60Záp!H51)","v":""},{"$f":"IF(SenioriU_60Záp!I51=0,\"\",SenioriU_60Záp!I51)","v":""},{"$f":"SenioriU_60Záp!K51","v":"nie"}]
[]
[null,"Kraj :",null,{"$f":"SeniorkyU_60Záp!$F$1","v":"Trenčiansky"},null,null,{"$f":"SeniorkyU_60Záp!$H$2","v":"31.3.2019"}]
[null,"MK senioriek U-60 2019",null,null,"Kolkáreň :",{"$f":"SeniorkyU_60Záp!$E$2","v":"Trenčín"}]
[]
[null,"Por.","Hráči","Č.r.p.","Klub","Plné","Dorážka","Chyby","Spolu"]
[]
[null,"1.",{"$f":"IF(SeniorkyU_60Záp!C4=0,\"\",SeniorkyU_60Záp!C4)","v":"Nemčeková Anna"},{"$f":"IF(SeniorkyU_60Záp!D4=0,\"\",SeniorkyU_60Záp!D4)","v":1002},{"$f":"IF(SeniorkyU_60Záp!E4=0,\"\",SeniorkyU_60Záp!E4)","v":"MKK Stará Turá"},{"$f":"IF(SeniorkyU_60Záp!F4=0,\"\",SeniorkyU_60Záp!F4)","v":370},{"$f":"IF(SeniorkyU_60Záp!G4=0,\"\",SeniorkyU_60Záp!G4)","v":134},{"$f":"IF(SeniorkyU_60Záp!H4=0,\"\",SeniorkyU_60Záp!H4)","v":13},{"$f":"IF(SeniorkyU_60Záp!I4=0,\"\",SeniorkyU_60Záp!I4)","v":504},{"$f":"SeniorkyU_60Záp!K4","v":"áno"}]
[null,"2.",{"$f":"IF(SeniorkyU_60Záp!C5=0,\"\",SeniorkyU_60Záp!C5)","v":"Garafová Magda"},{"$f":"IF(SeniorkyU_60Záp!D5=0,\"\",SeniorkyU_60Záp!D5)","v":7875},{"$f":"IF(SeniorkyU_60Záp!E5=0,\"\",SeniorkyU_60Záp!E5)","v":"MKK Stará Turá"},{"$f":"IF(SeniorkyU_60Záp!F5=0,\"\",SeniorkyU_60Záp!F5)","v":347},{"$f":"IF(SeniorkyU_60Záp!G5=0,\"\",SeniorkyU_60Záp!G5)","v":146},{"$f":"IF(SeniorkyU_60Záp!H5=0,\"\",SeniorkyU_60Záp!H5)","v":12},{"$f":"IF(SeniorkyU_60Záp!I5=0,\"\",SeniorkyU_60Záp!I5)","v":493},{"$f":"SeniorkyU_60Záp!K5","v":"áno"}]
[null,"3.",{"$f":"IF(SeniorkyU_60Záp!C6=0,\"\",SeniorkyU_60Záp!C6)","v":""},{"$f":"IF(SeniorkyU_60Záp!D6=0,\"\",SeniorkyU_60Záp!D6)","v":""},{"$f":"IF(SeniorkyU_60Záp!E6=0,\"\",SeniorkyU_60Záp!E6)","v":""},{"$f":"IF(SeniorkyU_60Záp!F6=0,\"\",SeniorkyU_60Záp!F6)","v":""},{"$f":"IF(SeniorkyU_60Záp!G6=0,\"\",SeniorkyU_60Záp!G6)","v":""},{"$f":"IF(SeniorkyU_60Záp!H6=0,\"\",SeniorkyU_60Záp!H6)","v":""},{"$f":"IF(SeniorkyU_60Záp!I6=0,\"\",SeniorkyU_60Záp!I6)","v":""},{"$f":"SeniorkyU_60Záp!K6","v":"nie"}]
[null,"4.",{"$f":"IF(SeniorkyU_60Záp!C7=0,\"\",SeniorkyU_60Záp!C7)","v":""},{"$f":"IF(SeniorkyU_60Záp!D7=0,\"\",SeniorkyU_60Záp!D7)","v":""},{"$f":"IF(SeniorkyU_60Záp!E7=0,\"\",SeniorkyU_60Záp!E7)","v":""},{"$f":"IF(SeniorkyU_60Záp!F7=0,\"\",SeniorkyU_60Záp!F7)","v":""},{"$f":"IF(SeniorkyU_60Záp!G7=0,\"\",SeniorkyU_60Záp!G7)","v":""},{"$f":"IF(SeniorkyU_60Záp!H7=0,\"\",SeniorkyU_60Záp!H7)","v":""},{"$f":"IF(SeniorkyU_60Záp!I7=0,\"\",SeniorkyU_60Záp!I7)","v":""},{"$f":"SeniorkyU_60Záp!K7","v":"nie"}]
[null,"5.",{"$f":"IF(SeniorkyU_60Záp!C8=0,\"\",SeniorkyU_60Záp!C8)","v":""},{"$f":"IF(SeniorkyU_60Záp!D8=0,\"\",SeniorkyU_60Záp!D8)","v":""},{"$f":"IF(SeniorkyU_60Záp!E8=0,\"\",SeniorkyU_60Záp!E8)","v":""},{"$f":"IF(SeniorkyU_60Záp!F8=0,\"\",SeniorkyU_60Záp!F8)","v":""},{"$f":"IF(SeniorkyU_60Záp!G8=0,\"\",SeniorkyU_60Záp!G8)","v":""},{"$f":"IF(SeniorkyU_60Záp!H8=0,\"\",SeniorkyU_60Záp!H8)","v":""},{"$f":"IF(SeniorkyU_60Záp!I8=0,\"\",SeniorkyU_60Záp!I8)","v":""},{"$f":"SeniorkyU_60Záp!K8","v":"nie"}]
[null,"6.",{"$f":"IF(SeniorkyU_60Záp!C9=0,\"\",SeniorkyU_60Záp!C9)","v":""},{"$f":"IF(SeniorkyU_60Záp!D9=0,\"\",SeniorkyU_60Záp!D9)","v":""},{"$f":"IF(SeniorkyU_60Záp!E9=0,\"\",SeniorkyU_60Záp!E9)","v":""},{"$f":"IF(SeniorkyU_60Záp!F9=0,\"\",SeniorkyU_60Záp!F9)","v":""},{"$f":"IF(SeniorkyU_60Záp!G9=0,\"\",SeniorkyU_60Záp!G9)","v":""},{"$f":"IF(SeniorkyU_60Záp!H9=0,\"\",SeniorkyU_60Záp!H9)","v":""},{"$f":"IF(SeniorkyU_60Záp!I9=0,\"\",SeniorkyU_60Záp!I9)","v":""},{"$f":"SeniorkyU_60Záp!K9","v":"nie"}]
[null,"7.",{"$f":"IF(SeniorkyU_60Záp!C10=0,\"\",SeniorkyU_60Záp!C10)","v":""},{"$f":"IF(SeniorkyU_60Záp!D10=0,\"\",SeniorkyU_60Záp!D10)","v":""},{"$f":"IF(SeniorkyU_60Záp!E10=0,\"\",SeniorkyU_60Záp!E10)","v":""},{"$f":"IF(SeniorkyU_60Záp!F10=0,\"\",SeniorkyU_60Záp!F10)","v":""},{"$f":"IF(SeniorkyU_60Záp!G10=0,\"\",SeniorkyU_60Záp!G10)","v":""},{"$f":"IF(SeniorkyU_60Záp!H10=0,\"\",SeniorkyU_60Záp!H10)","v":""},{"$f":"IF(SeniorkyU_60Záp!I10=0,\"\",SeniorkyU_60Záp!I10)","v":""},{"$f":"SeniorkyU_60Záp!K10","v":"nie"}]
[null,"8.",{"$f":"IF(SeniorkyU_60Záp!C11=0,\"\",SeniorkyU_60Záp!C11)","v":""},{"$f":"IF(SeniorkyU_60Záp!D11=0,\"\",SeniorkyU_60Záp!D11)","v":""},{"$f":"IF(SeniorkyU_60Záp!E11=0,\"\",SeniorkyU_60Záp!E11)","v":""},{"$f":"IF(SeniorkyU_60Záp!F11=0,\"\",SeniorkyU_60Záp!F11)","v":""},{"$f":"IF(SeniorkyU_60Záp!G11=0,\"\",SeniorkyU_60Záp!G11)","v":""},{"$f":"IF(SeniorkyU_60Záp!H11=0,\"\",SeniorkyU_60Záp!H11)","v":""},{"$f":"IF(SeniorkyU_60Záp!I11=0,\"\",SeniorkyU_60Záp!I11)","v":""},{"$f":"SeniorkyU_60Záp!K11","v":"nie"}]
[null,"9.",{"$f":"IF(SeniorkyU_60Záp!C12=0,\"\",SeniorkyU_60Záp!C12)","v":""},{"$f":"IF(SeniorkyU_60Záp!D12=0,\"\",SeniorkyU_60Záp!D12)","v":""},{"$f":"IF(SeniorkyU_60Záp!E12=0,\"\",SeniorkyU_60Záp!E12)","v":""},{"$f":"IF(SeniorkyU_60Záp!F12=0,\"\",SeniorkyU_60Záp!F12)","v":""},{"$f":"IF(SeniorkyU_60Záp!G12=0,\"\",SeniorkyU_60Záp!G12)","v":""},{"$f":"IF(SeniorkyU_60Záp!H12=0,\"\",SeniorkyU_60Záp!H12)","v":""},{"$f":"IF(SeniorkyU_60Záp!I12=0,\"\",SeniorkyU_60Záp!I12)","v":""},{"$f":"SeniorkyU_60Záp!K12","v":"nie"}]
[null,"10.",{"$f":"IF(SeniorkyU_60Záp!C13=0,\"\",SeniorkyU_60Záp!C13)","v":""},{"$f":"IF(SeniorkyU_60Záp!D13=0,\"\",SeniorkyU_60Záp!D13)","v":""},{"$f":"IF(SeniorkyU_60Záp!E13=0,\"\",SeniorkyU_60Záp!E13)","v":""},{"$f":"IF(SeniorkyU_60Záp!F13=0,\"\",SeniorkyU_60Záp!F13)","v":""},{"$f":"IF(SeniorkyU_60Záp!G13=0,\"\",SeniorkyU_60Záp!G13)","v":""},{"$f":"IF(SeniorkyU_60Záp!H13=0,\"\",SeniorkyU_60Záp!H13)","v":""},{"$f":"IF(SeniorkyU_60Záp!I13=0,\"\",SeniorkyU_60Záp!I13)","v":""},{"$f":"SeniorkyU_60Záp!K13","v":"nie"}]
[null,"11.",{"$f":"IF(SeniorkyU_60Záp!C14=0,\"\",SeniorkyU_60Záp!C14)","v":""},{"$f":"IF(SeniorkyU_60Záp!D14=0,\"\",SeniorkyU_60Záp!D14)","v":""},{"$f":"IF(SeniorkyU_60Záp!E14=0,\"\",SeniorkyU_60Záp!E14)","v":""},{"$f":"IF(SeniorkyU_60Záp!F14=0,\"\",SeniorkyU_60Záp!F14)","v":""},{"$f":"IF(SeniorkyU_60Záp!G14=0,\"\",SeniorkyU_60Záp!G14)","v":""},{"$f":"IF(SeniorkyU_60Záp!H14=0,\"\",SeniorkyU_60Záp!H14)","v":""},{"$f":"IF(SeniorkyU_60Záp!I14=0,\"\",SeniorkyU_60Záp!I14)","v":""},{"$f":"SeniorkyU_60Záp!K14","v":"nie"}]
[null,"12.",{"$f":"IF(SeniorkyU_60Záp!C15=0,\"\",SeniorkyU_60Záp!C15)","v":""},{"$f":"IF(SeniorkyU_60Záp!D15=0,\"\",SeniorkyU_60Záp!D15)","v":""},{"$f":"IF(SeniorkyU_60Záp!E15=0,\"\",SeniorkyU_60Záp!E15)","v":""},{"$f":"IF(SeniorkyU_60Záp!F15=0,\"\",SeniorkyU_60Záp!F15)","v":""},{"$f":"IF(SeniorkyU_60Záp!G15=0,\"\",SeniorkyU_60Záp!G15)","v":""},{"$f":"IF(SeniorkyU_60Záp!H15=0,\"\",SeniorkyU_60Záp!H15)","v":""},{"$f":"IF(SeniorkyU_60Záp!I15=0,\"\",SeniorkyU_60Záp!I15)","v":""},{"$f":"SeniorkyU_60Záp!K15","v":"nie"}]
[null,"13.",{"$f":"IF(SeniorkyU_60Záp!C16=0,\"\",SeniorkyU_60Záp!C16)","v":""},{"$f":"IF(SeniorkyU_60Záp!D16=0,\"\",SeniorkyU_60Záp!D16)","v":""},{"$f":"IF(SeniorkyU_60Záp!E16=0,\"\",SeniorkyU_60Záp!E16)","v":""},{"$f":"IF(SeniorkyU_60Záp!F16=0,\"\",SeniorkyU_60Záp!F16)","v":""},{"$f":"IF(SeniorkyU_60Záp!G16=0,\"\",SeniorkyU_60Záp!G16)","v":""},{"$f":"IF(SeniorkyU_60Záp!H16=0,\"\",SeniorkyU_60Záp!H16)","v":""},{"$f":"IF(SeniorkyU_60Záp!I16=0,\"\",SeniorkyU_60Záp!I16)","v":""},{"$f":"SeniorkyU_60Záp!K16","v":"nie"}]
[null,"14.",{"$f":"IF(SeniorkyU_60Záp!C17=0,\"\",SeniorkyU_60Záp!C17)","v":""},{"$f":"IF(SeniorkyU_60Záp!D17=0,\"\",SeniorkyU_60Záp!D17)","v":""},{"$f":"IF(SeniorkyU_60Záp!E17=0,\"\",SeniorkyU_60Záp!E17)","v":""},{"$f":"IF(SeniorkyU_60Záp!F17=0,\"\",SeniorkyU_60Záp!F17)","v":""},{"$f":"IF(SeniorkyU_60Záp!G17=0,\"\",SeniorkyU_60Záp!G17)","v":""},{"$f":"IF(SeniorkyU_60Záp!H17=0,\"\",SeniorkyU_60Záp!H17)","v":""},{"$f":"IF(SeniorkyU_60Záp!I17=0,\"\",SeniorkyU_60Záp!I17)","v":""},{"$f":"SeniorkyU_60Záp!K17","v":"nie"}]
[null,"15.",{"$f":"IF(SeniorkyU_60Záp!C18=0,\"\",SeniorkyU_60Záp!C18)","v":""},{"$f":"IF(SeniorkyU_60Záp!D18=0,\"\",SeniorkyU_60Záp!D18)","v":""},{"$f":"IF(SeniorkyU_60Záp!E18=0,\"\",SeniorkyU_60Záp!E18)","v":""},{"$f":"IF(SeniorkyU_60Záp!F18=0,\"\",SeniorkyU_60Záp!F18)","v":""},{"$f":"IF(SeniorkyU_60Záp!G18=0,\"\",SeniorkyU_60Záp!G18)","v":""},{"$f":"IF(SeniorkyU_60Záp!H18=0,\"\",SeniorkyU_60Záp!H18)","v":""},{"$f":"IF(SeniorkyU_60Záp!I18=0,\"\",SeniorkyU_60Záp!I18)","v":""},{"$f":"SeniorkyU_60Záp!K18","v":"nie"}]
[null,"16.",{"$f":"IF(SeniorkyU_60Záp!C19=0,\"\",SeniorkyU_60Záp!C19)","v":""},{"$f":"IF(SeniorkyU_60Záp!D19=0,\"\",SeniorkyU_60Záp!D19)","v":""},{"$f":"IF(SeniorkyU_60Záp!E19=0,\"\",SeniorkyU_60Záp!E19)","v":""},{"$f":"IF(SeniorkyU_60Záp!F19=0,\"\",SeniorkyU_60Záp!F19)","v":""},{"$f":"IF(SeniorkyU_60Záp!G19=0,\"\",SeniorkyU_60Záp!G19)","v":""},{"$f":"IF(SeniorkyU_60Záp!H19=0,\"\",SeniorkyU_60Záp!H19)","v":""},{"$f":"IF(SeniorkyU_60Záp!I19=0,\"\",SeniorkyU_60Záp!I19)","v":""},{"$f":"SeniorkyU_60Záp!K19","v":"nie"}]
[null,"17.",{"$f":"IF(SeniorkyU_60Záp!C20=0,\"\",SeniorkyU_60Záp!C20)","v":""},{"$f":"IF(SeniorkyU_60Záp!D20=0,\"\",SeniorkyU_60Záp!D20)","v":""},{"$f":"IF(SeniorkyU_60Záp!E20=0,\"\",SeniorkyU_60Záp!E20)","v":""},{"$f":"IF(SeniorkyU_60Záp!F20=0,\"\",SeniorkyU_60Záp!F20)","v":""},{"$f":"IF(SeniorkyU_60Záp!G20=0,\"\",SeniorkyU_60Záp!G20)","v":""},{"$f":"IF(SeniorkyU_60Záp!H20=0,\"\",SeniorkyU_60Záp!H20)","v":""},{"$f":"IF(SeniorkyU_60Záp!I20=0,\"\",SeniorkyU_60Záp!I20)","v":""},{"$f":"SeniorkyU_60Záp!K20","v":"nie"}]
[null,"18.",{"$f":"IF(SeniorkyU_60Záp!C21=0,\"\",SeniorkyU_60Záp!C21)","v":""},{"$f":"IF(SeniorkyU_60Záp!D21=0,\"\",SeniorkyU_60Záp!D21)","v":""},{"$f":"IF(SeniorkyU_60Záp!E21=0,\"\",SeniorkyU_60Záp!E21)","v":""},{"$f":"IF(SeniorkyU_60Záp!F21=0,\"\",SeniorkyU_60Záp!F21)","v":""},{"$f":"IF(SeniorkyU_60Záp!G21=0,\"\",SeniorkyU_60Záp!G21)","v":""},{"$f":"IF(SeniorkyU_60Záp!H21=0,\"\",SeniorkyU_60Záp!H21)","v":""},{"$f":"IF(SeniorkyU_60Záp!I21=0,\"\",SeniorkyU_60Záp!I21)","v":""},{"$f":"SeniorkyU_60Záp!K21","v":"nie"}]
[null,"19.",{"$f":"IF(SeniorkyU_60Záp!C22=0,\"\",SeniorkyU_60Záp!C22)","v":""},{"$f":"IF(SeniorkyU_60Záp!D22=0,\"\",SeniorkyU_60Záp!D22)","v":""},{"$f":"IF(SeniorkyU_60Záp!E22=0,\"\",SeniorkyU_60Záp!E22)","v":""},{"$f":"IF(SeniorkyU_60Záp!F22=0,\"\",SeniorkyU_60Záp!F22)","v":""},{"$f":"IF(SeniorkyU_60Záp!G22=0,\"\",SeniorkyU_60Záp!G22)","v":""},{"$f":"IF(SeniorkyU_60Záp!H22=0,\"\",SeniorkyU_60Záp!H22)","v":""},{"$f":"IF(SeniorkyU_60Záp!I22=0,\"\",SeniorkyU_60Záp!I22)","v":""},{"$f":"SeniorkyU_60Záp!K22","v":"nie"}]
[null,"20.",{"$f":"IF(SeniorkyU_60Záp!C23=0,\"\",SeniorkyU_60Záp!C23)","v":""},{"$f":"IF(SeniorkyU_60Záp!D23=0,\"\",SeniorkyU_60Záp!D23)","v":""},{"$f":"IF(SeniorkyU_60Záp!E23=0,\"\",SeniorkyU_60Záp!E23)","v":""},{"$f":"IF(SeniorkyU_60Záp!F23=0,\"\",SeniorkyU_60Záp!F23)","v":""},{"$f":"IF(SeniorkyU_60Záp!G23=0,\"\",SeniorkyU_60Záp!G23)","v":""},{"$f":"IF(SeniorkyU_60Záp!H23=0,\"\",SeniorkyU_60Záp!H23)","v":""},{"$f":"IF(SeniorkyU_60Záp!I23=0,\"\",SeniorkyU_60Záp!I23)","v":""},{"$f":"SeniorkyU_60Záp!K23","v":"nie"}]
[null,"21.",{"$f":"IF(SeniorkyU_60Záp!C24=0,\"\",SeniorkyU_60Záp!C24)","v":""},{"$f":"IF(SeniorkyU_60Záp!D24=0,\"\",SeniorkyU_60Záp!D24)","v":""},{"$f":"IF(SeniorkyU_60Záp!E24=0,\"\",SeniorkyU_60Záp!E24)","v":""},{"$f":"IF(SeniorkyU_60Záp!F24=0,\"\",SeniorkyU_60Záp!F24)","v":""},{"$f":"IF(SeniorkyU_60Záp!G24=0,\"\",SeniorkyU_60Záp!G24)","v":""},{"$f":"IF(SeniorkyU_60Záp!H24=0,\"\",SeniorkyU_60Záp!H24)","v":""},{"$f":"IF(SeniorkyU_60Záp!I24=0,\"\",SeniorkyU_60Záp!I24)","v":""},{"$f":"SeniorkyU_60Záp!K24","v":"nie"}]
[null,"22.",{"$f":"IF(SeniorkyU_60Záp!C25=0,\"\",SeniorkyU_60Záp!C25)","v":""},{"$f":"IF(SeniorkyU_60Záp!D25=0,\"\",SeniorkyU_60Záp!D25)","v":""},{"$f":"IF(SeniorkyU_60Záp!E25=0,\"\",SeniorkyU_60Záp!E25)","v":""},{"$f":"IF(SeniorkyU_60Záp!F25=0,\"\",SeniorkyU_60Záp!F25)","v":""},{"$f":"IF(SeniorkyU_60Záp!G25=0,\"\",SeniorkyU_60Záp!G25)","v":""},{"$f":"IF(SeniorkyU_60Záp!H25=0,\"\",SeniorkyU_60Záp!H25)","v":""},{"$f":"IF(SeniorkyU_60Záp!I25=0,\"\",SeniorkyU_60Záp!I25)","v":""},{"$f":"SeniorkyU_60Záp!K25","v":"nie"}]
[null,"23.",{"$f":"IF(SeniorkyU_60Záp!C26=0,\"\",SeniorkyU_60Záp!C26)","v":""},{"$f":"IF(SeniorkyU_60Záp!D26=0,\"\",SeniorkyU_60Záp!D26)","v":""},{"$f":"IF(SeniorkyU_60Záp!E26=0,\"\",SeniorkyU_60Záp!E26)","v":""},{"$f":"IF(SeniorkyU_60Záp!F26=0,\"\",SeniorkyU_60Záp!F26)","v":""},{"$f":"IF(SeniorkyU_60Záp!G26=0,\"\",SeniorkyU_60Záp!G26)","v":""},{"$f":"IF(SeniorkyU_60Záp!H26=0,\"\",SeniorkyU_60Záp!H26)","v":""},{"$f":"IF(SeniorkyU_60Záp!I26=0,\"\",SeniorkyU_60Záp!I26)","v":""},{"$f":"SeniorkyU_60Záp!K26","v":"nie"}]
[null,"24.",{"$f":"IF(SeniorkyU_60Záp!C27=0,\"\",SeniorkyU_60Záp!C27)","v":""},{"$f":"IF(SeniorkyU_60Záp!D27=0,\"\",SeniorkyU_60Záp!D27)","v":""},{"$f":"IF(SeniorkyU_60Záp!E27=0,\"\",SeniorkyU_60Záp!E27)","v":""},{"$f":"IF(SeniorkyU_60Záp!F27=0,\"\",SeniorkyU_60Záp!F27)","v":""},{"$f":"IF(SeniorkyU_60Záp!G27=0,\"\",SeniorkyU_60Záp!G27)","v":""},{"$f":"IF(SeniorkyU_60Záp!H27=0,\"\",SeniorkyU_60Záp!H27)","v":""},{"$f":"IF(SeniorkyU_60Záp!I27=0,\"\",SeniorkyU_60Záp!I27)","v":""},{"$f":"SeniorkyU_60Záp!K27","v":"nie"}]
[null,"25.",{"$f":"IF(SeniorkyU_60Záp!C28=0,\"\",SeniorkyU_60Záp!C28)","v":""},{"$f":"IF(SeniorkyU_60Záp!D28=0,\"\",SeniorkyU_60Záp!D28)","v":""},{"$f":"IF(SeniorkyU_60Záp!E28=0,\"\",SeniorkyU_60Záp!E28)","v":""},{"$f":"IF(SeniorkyU_60Záp!F28=0,\"\",SeniorkyU_60Záp!F28)","v":""},{"$f":"IF(SeniorkyU_60Záp!G28=0,\"\",SeniorkyU_60Záp!G28)","v":""},{"$f":"IF(SeniorkyU_60Záp!H28=0,\"\",SeniorkyU_60Záp!H28)","v":""},{"$f":"IF(SeniorkyU_60Záp!I28=0,\"\",SeniorkyU_60Záp!I28)","v":""},{"$f":"SeniorkyU_60Záp!K28","v":"nie"}]
[null,"26.",{"$f":"IF(SeniorkyU_60Záp!C29=0,\"\",SeniorkyU_60Záp!C29)","v":""},{"$f":"IF(SeniorkyU_60Záp!D29=0,\"\",SeniorkyU_60Záp!D29)","v":""},{"$f":"IF(SeniorkyU_60Záp!E29=0,\"\",SeniorkyU_60Záp!E29)","v":""},{"$f":"IF(SeniorkyU_60Záp!F29=0,\"\",SeniorkyU_60Záp!F29)","v":""},{"$f":"IF(SeniorkyU_60Záp!G29=0,\"\",SeniorkyU_60Záp!G29)","v":""},{"$f":"IF(SeniorkyU_60Záp!H29=0,\"\",SeniorkyU_60Záp!H29)","v":""},{"$f":"IF(SeniorkyU_60Záp!I29=0,\"\",SeniorkyU_60Záp!I29)","v":""},{"$f":"SeniorkyU_60Záp!K29","v":"nie"}]
[null,"27.",{"$f":"IF(SeniorkyU_60Záp!C30=0,\"\",SeniorkyU_60Záp!C30)","v":""},{"$f":"IF(SeniorkyU_60Záp!D30=0,\"\",SeniorkyU_60Záp!D30)","v":""},{"$f":"IF(SeniorkyU_60Záp!E30=0,\"\",SeniorkyU_60Záp!E30)","v":""},{"$f":"IF(SeniorkyU_60Záp!F30=0,\"\",SeniorkyU_60Záp!F30)","v":""},{"$f":"IF(SeniorkyU_60Záp!G30=0,\"\",SeniorkyU_60Záp!G30)","v":""},{"$f":"IF(SeniorkyU_60Záp!H30=0,\"\",SeniorkyU_60Záp!H30)","v":""},{"$f":"IF(SeniorkyU_60Záp!I30=0,\"\",SeniorkyU_60Záp!I30)","v":""},{"$f":"SeniorkyU_60Záp!K30","v":"nie"}]
[null,"28.",{"$f":"IF(SeniorkyU_60Záp!C31=0,\"\",SeniorkyU_60Záp!C31)","v":""},{"$f":"IF(SeniorkyU_60Záp!D31=0,\"\",SeniorkyU_60Záp!D31)","v":""},{"$f":"IF(SeniorkyU_60Záp!E31=0,\"\",SeniorkyU_60Záp!E31)","v":""},{"$f":"IF(SeniorkyU_60Záp!F31=0,\"\",SeniorkyU_60Záp!F31)","v":""},{"$f":"IF(SeniorkyU_60Záp!G31=0,\"\",SeniorkyU_60Záp!G31)","v":""},{"$f":"IF(SeniorkyU_60Záp!H31=0,\"\",SeniorkyU_60Záp!H31)","v":""},{"$f":"IF(SeniorkyU_60Záp!I31=0,\"\",SeniorkyU_60Záp!I31)","v":""},{"$f":"SeniorkyU_60Záp!K31","v":"nie"}]
[null,"29.",{"$f":"IF(SeniorkyU_60Záp!C32=0,\"\",SeniorkyU_60Záp!C32)","v":""},{"$f":"IF(SeniorkyU_60Záp!D32=0,\"\",SeniorkyU_60Záp!D32)","v":""},{"$f":"IF(SeniorkyU_60Záp!E32=0,\"\",SeniorkyU_60Záp!E32)","v":""},{"$f":"IF(SeniorkyU_60Záp!F32=0,\"\",SeniorkyU_60Záp!F32)","v":""},{"$f":"IF(SeniorkyU_60Záp!G32=0,\"\",SeniorkyU_60Záp!G32)","v":""},{"$f":"IF(SeniorkyU_60Záp!H32=0,\"\",SeniorkyU_60Záp!H32)","v":""},{"$f":"IF(SeniorkyU_60Záp!I32=0,\"\",SeniorkyU_60Záp!I32)","v":""},{"$f":"SeniorkyU_60Záp!K32","v":"nie"}]
[null,"30.",{"$f":"IF(SeniorkyU_60Záp!C33=0,\"\",SeniorkyU_60Záp!C33)","v":""},{"$f":"IF(SeniorkyU_60Záp!D33=0,\"\",SeniorkyU_60Záp!D33)","v":""},{"$f":"IF(SeniorkyU_60Záp!E33=0,\"\",SeniorkyU_60Záp!E33)","v":""},{"$f":"IF(SeniorkyU_60Záp!F33=0,\"\",SeniorkyU_60Záp!F33)","v":""},{"$f":"IF(SeniorkyU_60Záp!G33=0,\"\",SeniorkyU_60Záp!G33)","v":""},{"$f":"IF(SeniorkyU_60Záp!H33=0,\"\",SeniorkyU_60Záp!H33)","v":""},{"$f":"IF(SeniorkyU_60Záp!I33=0,\"\",SeniorkyU_60Záp!I33)","v":""},{"$f":"SeniorkyU_60Záp!K33","v":"nie"}]
[]
[null,"Kraj :",null,{"$f":"JunioriZáp!$F$1","v":"Trenčiansky"},null,null,{"$f":"JunioriZáp!$H$2","v":"20.1.2019"}]
[null,"MK juniorov U-23 2019",null,null,"Kolkáreň :",{"$f":"JunioriZáp!$E$2","v":"Stará Turá"}]
[]
[null,"Por.","Hráči","Č.r.p.","Klub","Plné","Dorážka","Chyby","Spolu"]
[]
[null,"1.",{"$f":"IF(JunioriZáp!C4=0,\"\",JunioriZáp!C4)","v":"Dzúrik Martin"},{"$f":"IF(JunioriZáp!D4=0,\"\",JunioriZáp!D4)","v":7958},{"$f":"IF(JunioriZáp!E4=0,\"\",JunioriZáp!E4)","v":"TKK Trenčín"},{"$f":"IF(JunioriZáp!F4=0,\"\",JunioriZáp!F4)","v":384},{"$f":"IF(JunioriZáp!G4=0,\"\",JunioriZáp!G4)","v":218},{"$f":"IF(JunioriZáp!H4=\"\",\"\",JunioriZáp!H4)","v":3},{"$f":"IF(JunioriZáp!I4=0,\"\",JunioriZáp!I4)","v":602},{"$f":"JunioriZáp!K4","v":"áno"}]
[null,"2.",{"$f":"IF(JunioriZáp!C8=0,\"\",JunioriZáp!C8)","v":"Urban Jakub"},{"$f":"IF(JunioriZáp!D8=0,\"\",JunioriZáp!D8)","v":554},{"$f":"IF(JunioriZáp!E8=0,\"\",JunioriZáp!E8)","v":"KK Pobedim"},{"$f":"IF(JunioriZáp!F8=0,\"\",JunioriZáp!F8)","v":407},{"$f":"IF(JunioriZáp!G8=0,\"\",JunioriZáp!G8)","v":191},{"$f":"IF(JunioriZáp!H8=\"\",\"\",JunioriZáp!H8)","v":6},{"$f":"IF(JunioriZáp!I8=0,\"\",JunioriZáp!I8)","v":598},{"$f":"JunioriZáp!K8","v":"áno"}]
[null,"3.",{"$f":"IF(JunioriZáp!C9=0,\"\",JunioriZáp!C9)","v":"Vajer Michal"},{"$f":"IF(JunioriZáp!D9=0,\"\",JunioriZáp!D9)","v":93},{"$f":"IF(JunioriZáp!E9=0,\"\",JunioriZáp!E9)","v":"KK Pobedim"},{"$f":"IF(JunioriZáp!F9=0,\"\",JunioriZáp!F9)","v":381},{"$f":"IF(JunioriZáp!G9=0,\"\",JunioriZáp!G9)","v":201},{"$f":"IF(JunioriZáp!H9=\"\",\"\",JunioriZáp!H9)","v":5},{"$f":"IF(JunioriZáp!I9=0,\"\",JunioriZáp!I9)","v":582},{"$f":"JunioriZáp!K9","v":"áno"}]
[null,"4.",{"$f":"IF(JunioriZáp!C5=0,\"\",JunioriZáp!C5)","v":"Truska Tomáš"},{"$f":"IF(JunioriZáp!D5=0,\"\",JunioriZáp!D5)","v":7968},{"$f":"IF(JunioriZáp!E5=0,\"\",JunioriZáp!E5)","v":"TKK Trenčín"},{"$f":"IF(JunioriZáp!F5=0,\"\",JunioriZáp!F5)","v":359},{"$f":"IF(JunioriZáp!G5=0,\"\",JunioriZáp!G5)","v":211},{"$f":"IF(JunioriZáp!H5=\"\",\"\",JunioriZáp!H5)","v":5},{"$f":"IF(JunioriZáp!I5=0,\"\",JunioriZáp!I5)","v":570},{"$f":"JunioriZáp!K5","v":"áno"}]
[null,"5.",{"$f":"IF(JunioriZáp!C11=0,\"\",JunioriZáp!C11)","v":"Čečot Rastislav"},{"$f":"IF(JunioriZáp!D11=0,\"\",JunioriZáp!D11)","v":1054},{"$f":"IF(JunioriZáp!E11=0,\"\",JunioriZáp!E11)","v":"MKK Stará Turá"},{"$f":"IF(JunioriZáp!F11=0,\"\",JunioriZáp!F11)","v":368},{"$f":"IF(JunioriZáp!G11=0,\"\",JunioriZáp!G11)","v":173},{"$f":"IF(JunioriZáp!H11=\"\",\"\",JunioriZáp!H11)","v":6},{"$f":"IF(JunioriZáp!I11=0,\"\",JunioriZáp!I11)","v":541},{"$f":"JunioriZáp!K11","v":"áno"}]
[null,"6.",{"$f":"IF(JunioriZáp!C7=0,\"\",JunioriZáp!C7)","v":"Paška Tomáš"},{"$f":"IF(JunioriZáp!D7=0,\"\",JunioriZáp!D7)","v":7968},{"$f":"IF(JunioriZáp!E7=0,\"\",JunioriZáp!E7)","v":"KK Moravské Lieskové"},{"$f":"IF(JunioriZáp!F7=0,\"\",JunioriZáp!F7)","v":365},{"$f":"IF(JunioriZáp!G7=0,\"\",JunioriZáp!G7)","v":175},{"$f":"IF(JunioriZáp!H7=\"\",\"\",JunioriZáp!H7)","v":8},{"$f":"IF(JunioriZáp!I7=0,\"\",JunioriZáp!I7)","v":540},{"$f":"JunioriZáp!K7","v":"áno"}]
[null,"7.",{"$f":"IF(JunioriZáp!C10=0,\"\",JunioriZáp!C10)","v":"Galbavý Ivan"},{"$f":"IF(JunioriZáp!D10=0,\"\",JunioriZáp!D10)","v":206},{"$f":"IF(JunioriZáp!E10=0,\"\",JunioriZáp!E10)","v":"MKK Stará Turá"},{"$f":"IF(JunioriZáp!F10=0,\"\",JunioriZáp!F10)","v":384},{"$f":"IF(JunioriZáp!G10=0,\"\",JunioriZáp!G10)","v":155},{"$f":"IF(JunioriZáp!H10=\"\",\"\",JunioriZáp!H10)","v":6},{"$f":"IF(JunioriZáp!I10=0,\"\",JunioriZáp!I10)","v":539},{"$f":"JunioriZáp!K10","v":"áno"}]
[null,"8.",{"$f":"IF(JunioriZáp!C6=0,\"\",JunioriZáp!C6)","v":"Černý Michal"},{"$f":"IF(JunioriZáp!D6=0,\"\",JunioriZáp!D6)","v":954},{"$f":"IF(JunioriZáp!E6=0,\"\",JunioriZáp!E6)","v":"KK Moravské Lieskové"},{"$f":"IF(JunioriZáp!F6=0,\"\",JunioriZáp!F6)","v":397},{"$f":"IF(JunioriZáp!G6=0,\"\",JunioriZáp!G6)","v":140},{"$f":"IF(JunioriZáp!H6=\"\",\"\",JunioriZáp!H6)","v":14},{"$f":"IF(JunioriZáp!I6=0,\"\",JunioriZáp!I6)","v":537},{"$f":"JunioriZáp!K6","v":"áno"}]
[null,"9.",{"$f":"IF(JunioriZáp!C12=0,\"\",JunioriZáp!C12)","v":""},{"$f":"IF(JunioriZáp!D12=0,\"\",JunioriZáp!D12)","v":""},{"$f":"IF(JunioriZáp!E12=0,\"\",JunioriZáp!E12)","v":""},{"$f":"IF(JunioriZáp!F12=0,\"\",JunioriZáp!F12)","v":""},{"$f":"IF(JunioriZáp!G12=0,\"\",JunioriZáp!G12)","v":""},{"$f":"IF(JunioriZáp!H12=\"\",\"\",JunioriZáp!H12)","v":""},{"$f":"IF(JunioriZáp!I12=0,\"\",JunioriZáp!I12)","v":""},{"$f":"JunioriZáp!K12","v":"nie"}]
[null,"10.",{"$f":"IF(JunioriZáp!C13=0,\"\",JunioriZáp!C13)","v":""},{"$f":"IF(JunioriZáp!D13=0,\"\",JunioriZáp!D13)","v":""},{"$f":"IF(JunioriZáp!E13=0,\"\",JunioriZáp!E13)","v":""},{"$f":"IF(JunioriZáp!F13=0,\"\",JunioriZáp!F13)","v":""},{"$f":"IF(JunioriZáp!G13=0,\"\",JunioriZáp!G13)","v":""},{"$f":"IF(JunioriZáp!H13=\"\",\"\",JunioriZáp!H13)","v":""},{"$f":"IF(JunioriZáp!I13=0,\"\",JunioriZáp!I13)","v":""},{"$f":"JunioriZáp!K13","v":"nie"}]
[null,"11.",{"$f":"IF(JunioriZáp!C14=0,\"\",JunioriZáp!C14)","v":""},{"$f":"IF(JunioriZáp!D14=0,\"\",JunioriZáp!D14)","v":""},{"$f":"IF(JunioriZáp!E14=0,\"\",JunioriZáp!E14)","v":""},{"$f":"IF(JunioriZáp!F14=0,\"\",JunioriZáp!F14)","v":""},{"$f":"IF(JunioriZáp!G14=0,\"\",JunioriZáp!G14)","v":""},{"$f":"IF(JunioriZáp!H14=\"\",\"\",JunioriZáp!H14)","v":""},{"$f":"IF(JunioriZáp!I14=0,\"\",JunioriZáp!I14)","v":""},{"$f":"JunioriZáp!K14","v":"nie"}]
[null,"12.",{"$f":"IF(JunioriZáp!C15=0,\"\",JunioriZáp!C15)","v":""},{"$f":"IF(JunioriZáp!D15=0,\"\",JunioriZáp!D15)","v":""},{"$f":"IF(JunioriZáp!E15=0,\"\",JunioriZáp!E15)","v":""},{"$f":"IF(JunioriZáp!F15=0,\"\",JunioriZáp!F15)","v":""},{"$f":"IF(JunioriZáp!G15=0,\"\",JunioriZáp!G15)","v":""},{"$f":"IF(JunioriZáp!H15=\"\",\"\",JunioriZáp!H15)","v":""},{"$f":"IF(JunioriZáp!I15=0,\"\",JunioriZáp!I15)","v":""},{"$f":"JunioriZáp!K15","v":"nie"}]
[null,"13.",{"$f":"IF(JunioriZáp!C16=0,\"\",JunioriZáp!C16)","v":""},{"$f":"IF(JunioriZáp!D16=0,\"\",JunioriZáp!D16)","v":""},{"$f":"IF(JunioriZáp!E16=0,\"\",JunioriZáp!E16)","v":""},{"$f":"IF(JunioriZáp!F16=0,\"\",JunioriZáp!F16)","v":""},{"$f":"IF(JunioriZáp!G16=0,\"\",JunioriZáp!G16)","v":""},{"$f":"IF(JunioriZáp!H16=\"\",\"\",JunioriZáp!H16)","v":""},{"$f":"IF(JunioriZáp!I16=0,\"\",JunioriZáp!I16)","v":""},{"$f":"JunioriZáp!K16","v":"nie"}]
[null,"14.",{"$f":"IF(JunioriZáp!C17=0,\"\",JunioriZáp!C17)","v":""},{"$f":"IF(JunioriZáp!D17=0,\"\",JunioriZáp!D17)","v":""},{"$f":"IF(JunioriZáp!E17=0,\"\",JunioriZáp!E17)","v":""},{"$f":"IF(JunioriZáp!F17=0,\"\",JunioriZáp!F17)","v":""},{"$f":"IF(JunioriZáp!G17=0,\"\",JunioriZáp!G17)","v":""},{"$f":"IF(JunioriZáp!H17=\"\",\"\",JunioriZáp!H17)","v":""},{"$f":"IF(JunioriZáp!I17=0,\"\",JunioriZáp!I17)","v":""},{"$f":"JunioriZáp!K17","v":"nie"}]
[null,"15.",{"$f":"IF(JunioriZáp!C18=0,\"\",JunioriZáp!C18)","v":""},{"$f":"IF(JunioriZáp!D18=0,\"\",JunioriZáp!D18)","v":""},{"$f":"IF(JunioriZáp!E18=0,\"\",JunioriZáp!E18)","v":""},{"$f":"IF(JunioriZáp!F18=0,\"\",JunioriZáp!F18)","v":""},{"$f":"IF(JunioriZáp!G18=0,\"\",JunioriZáp!G18)","v":""},{"$f":"IF(JunioriZáp!H18=\"\",\"\",JunioriZáp!H18)","v":""},{"$f":"IF(JunioriZáp!I18=0,\"\",JunioriZáp!I18)","v":""},{"$f":"JunioriZáp!K18","v":"nie"}]
[null,"16.",{"$f":"IF(JunioriZáp!C19=0,\"\",JunioriZáp!C19)","v":""},{"$f":"IF(JunioriZáp!D19=0,\"\",JunioriZáp!D19)","v":""},{"$f":"IF(JunioriZáp!E19=0,\"\",JunioriZáp!E19)","v":""},{"$f":"IF(JunioriZáp!F19=0,\"\",JunioriZáp!F19)","v":""},{"$f":"IF(JunioriZáp!G19=0,\"\",JunioriZáp!G19)","v":""},{"$f":"IF(JunioriZáp!H19=\"\",\"\",JunioriZáp!H19)","v":""},{"$f":"IF(JunioriZáp!I19=0,\"\",JunioriZáp!I19)","v":""},{"$f":"JunioriZáp!K19","v":"nie"}]
[null,"17.",{"$f":"IF(JunioriZáp!C20=0,\"\",JunioriZáp!C20)","v":""},{"$f":"IF(JunioriZáp!D20=0,\"\",JunioriZáp!D20)","v":""},{"$f":"IF(JunioriZáp!E20=0,\"\",JunioriZáp!E20)","v":""},{"$f":"IF(JunioriZáp!F20=0,\"\",JunioriZáp!F20)","v":""},{"$f":"IF(JunioriZáp!G20=0,\"\",JunioriZáp!G20)","v":""},{"$f":"IF(JunioriZáp!H20=\"\",\"\",JunioriZáp!H20)","v":""},{"$f":"IF(JunioriZáp!I20=0,\"\",JunioriZáp!I20)","v":""},{"$f":"JunioriZáp!K20","v":"nie"}]
[null,"18.",{"$f":"IF(JunioriZáp!C21=0,\"\",JunioriZáp!C21)","v":""},{"$f":"IF(JunioriZáp!D21=0,\"\",JunioriZáp!D21)","v":""},{"$f":"IF(JunioriZáp!E21=0,\"\",JunioriZáp!E21)","v":""},{"$f":"IF(JunioriZáp!F21=0,\"\",JunioriZáp!F21)","v":""},{"$f":"IF(JunioriZáp!G21=0,\"\",JunioriZáp!G21)","v":""},{"$f":"IF(JunioriZáp!H21=\"\",\"\",JunioriZáp!H21)","v":""},{"$f":"IF(JunioriZáp!I21=0,\"\",JunioriZáp!I21)","v":""},{"$f":"JunioriZáp!K21","v":"nie"}]
[null,"19.",{"$f":"IF(JunioriZáp!C22=0,\"\",JunioriZáp!C22)","v":""},{"$f":"IF(JunioriZáp!D22=0,\"\",JunioriZáp!D22)","v":""},{"$f":"IF(JunioriZáp!E22=0,\"\",JunioriZáp!E22)","v":""},{"$f":"IF(JunioriZáp!F22=0,\"\",JunioriZáp!F22)","v":""},{"$f":"IF(JunioriZáp!G22=0,\"\",JunioriZáp!G22)","v":""},{"$f":"IF(JunioriZáp!H22=\"\",\"\",JunioriZáp!H22)","v":""},{"$f":"IF(JunioriZáp!I22=0,\"\",JunioriZáp!I22)","v":""},{"$f":"JunioriZáp!K22","v":"nie"}]
[null,"20.",{"$f":"IF(JunioriZáp!C23=0,\"\",JunioriZáp!C23)","v":""},{"$f":"IF(JunioriZáp!D23=0,\"\",JunioriZáp!D23)","v":""},{"$f":"IF(JunioriZáp!E23=0,\"\",JunioriZáp!E23)","v":""},{"$f":"IF(JunioriZáp!F23=0,\"\",JunioriZáp!F23)","v":""},{"$f":"IF(JunioriZáp!G23=0,\"\",JunioriZáp!G23)","v":""},{"$f":"IF(JunioriZáp!H23=\"\",\"\",JunioriZáp!H23)","v":""},{"$f":"IF(JunioriZáp!I23=0,\"\",JunioriZáp!I23)","v":""},{"$f":"JunioriZáp!K23","v":"nie"}]
[null,"21.",{"$f":"IF(JunioriZáp!C24=0,\"\",JunioriZáp!C24)","v":""},{"$f":"IF(JunioriZáp!D24=0,\"\",JunioriZáp!D24)","v":""},{"$f":"IF(JunioriZáp!E24=0,\"\",JunioriZáp!E24)","v":""},{"$f":"IF(JunioriZáp!F24=0,\"\",JunioriZáp!F24)","v":""},{"$f":"IF(JunioriZáp!G24=0,\"\",JunioriZáp!G24)","v":""},{"$f":"IF(JunioriZáp!H24=\"\",\"\",JunioriZáp!H24)","v":""},{"$f":"IF(JunioriZáp!I24=0,\"\",JunioriZáp!I24)","v":""},{"$f":"JunioriZáp!K24","v":"nie"}]
[null,"22.",{"$f":"IF(JunioriZáp!C25=0,\"\",JunioriZáp!C25)","v":""},{"$f":"IF(JunioriZáp!D25=0,\"\",JunioriZáp!D25)","v":""},{"$f":"IF(JunioriZáp!E25=0,\"\",JunioriZáp!E25)","v":""},{"$f":"IF(JunioriZáp!F25=0,\"\",JunioriZáp!F25)","v":""},{"$f":"IF(JunioriZáp!G25=0,\"\",JunioriZáp!G25)","v":""},{"$f":"IF(JunioriZáp!H25=\"\",\"\",JunioriZáp!H25)","v":""},{"$f":"IF(JunioriZáp!I25=0,\"\",JunioriZáp!I25)","v":""},{"$f":"JunioriZáp!K25","v":"nie"}]
[null,"23.",{"$f":"IF(JunioriZáp!C26=0,\"\",JunioriZáp!C26)","v":""},{"$f":"IF(JunioriZáp!D26=0,\"\",JunioriZáp!D26)","v":""},{"$f":"IF(JunioriZáp!E26=0,\"\",JunioriZáp!E26)","v":""},{"$f":"IF(JunioriZáp!F26=0,\"\",JunioriZáp!F26)","v":""},{"$f":"IF(JunioriZáp!G26=0,\"\",JunioriZáp!G26)","v":""},{"$f":"IF(JunioriZáp!H26=\"\",\"\",JunioriZáp!H26)","v":""},{"$f":"IF(JunioriZáp!I26=0,\"\",JunioriZáp!I26)","v":""},{"$f":"JunioriZáp!K26","v":"nie"}]
[null,"24.",{"$f":"IF(JunioriZáp!C27=0,\"\",JunioriZáp!C27)","v":""},{"$f":"IF(JunioriZáp!D27=0,\"\",JunioriZáp!D27)","v":""},{"$f":"IF(JunioriZáp!E27=0,\"\",JunioriZáp!E27)","v":""},{"$f":"IF(JunioriZáp!F27=0,\"\",JunioriZáp!F27)","v":""},{"$f":"IF(JunioriZáp!G27=0,\"\",JunioriZáp!G27)","v":""},{"$f":"IF(JunioriZáp!H27=\"\",\"\",JunioriZáp!H27)","v":""},{"$f":"IF(JunioriZáp!I27=0,\"\",JunioriZáp!I27)","v":""},{"$f":"JunioriZáp!K27","v":"nie"}]
[null,"25.",{"$f":"IF(JunioriZáp!C28=0,\"\",JunioriZáp!C28)","v":""},{"$f":"IF(JunioriZáp!D28=0,\"\",JunioriZáp!D28)","v":""},{"$f":"IF(JunioriZáp!E28=0,\"\",JunioriZáp!E28)","v":""},{"$f":"IF(JunioriZáp!F28=0,\"\",JunioriZáp!F28)","v":""},{"$f":"IF(JunioriZáp!G28=0,\"\",JunioriZáp!G28)","v":""},{"$f":"IF(JunioriZáp!H28=\"\",\"\",JunioriZáp!H28)","v":""},{"$f":"IF(JunioriZáp!I28=0,\"\",JunioriZáp!I28)","v":""},{"$f":"JunioriZáp!K28","v":"nie"}]
[null,"26.",{"$f":"IF(JunioriZáp!C29=0,\"\",JunioriZáp!C29)","v":""},{"$f":"IF(JunioriZáp!D29=0,\"\",JunioriZáp!D29)","v":""},{"$f":"IF(JunioriZáp!E29=0,\"\",JunioriZáp!E29)","v":""},{"$f":"IF(JunioriZáp!F29=0,\"\",JunioriZáp!F29)","v":""},{"$f":"IF(JunioriZáp!G29=0,\"\",JunioriZáp!G29)","v":""},{"$f":"IF(JunioriZáp!H29=\"\",\"\",JunioriZáp!H29)","v":""},{"$f":"IF(JunioriZáp!I29=0,\"\",JunioriZáp!I29)","v":""},{"$f":"JunioriZáp!K29","v":"nie"}]
[null,"27.",{"$f":"IF(JunioriZáp!C30=0,\"\",JunioriZáp!C30)","v":""},{"$f":"IF(JunioriZáp!D30=0,\"\",JunioriZáp!D30)","v":""},{"$f":"IF(JunioriZáp!E30=0,\"\",JunioriZáp!E30)","v":""},{"$f":"IF(JunioriZáp!F30=0,\"\",JunioriZáp!F30)","v":""},{"$f":"IF(JunioriZáp!G30=0,\"\",JunioriZáp!G30)","v":""},{"$f":"IF(JunioriZáp!H30=\"\",\"\",JunioriZáp!H30)","v":""},{"$f":"IF(JunioriZáp!I30=0,\"\",JunioriZáp!I30)","v":""},{"$f":"JunioriZáp!K30","v":"nie"}]
[null,"28.",{"$f":"IF(JunioriZáp!C31=0,\"\",JunioriZáp!C31)","v":""},{"$f":"IF(JunioriZáp!D31=0,\"\",JunioriZáp!D31)","v":""},{"$f":"IF(JunioriZáp!E31=0,\"\",JunioriZáp!E31)","v":""},{"$f":"IF(JunioriZáp!F31=0,\"\",JunioriZáp!F31)","v":""},{"$f":"IF(JunioriZáp!G31=0,\"\",JunioriZáp!G31)","v":""},{"$f":"IF(JunioriZáp!H31=\"\",\"\",JunioriZáp!H31)","v":""},{"$f":"IF(JunioriZáp!I31=0,\"\",JunioriZáp!I31)","v":""},{"$f":"JunioriZáp!K31","v":"nie"}]
[null,"29.",{"$f":"IF(JunioriZáp!C32=0,\"\",JunioriZáp!C32)","v":""},{"$f":"IF(JunioriZáp!D32=0,\"\",JunioriZáp!D32)","v":""},{"$f":"IF(JunioriZáp!E32=0,\"\",JunioriZáp!E32)","v":""},{"$f":"IF(JunioriZáp!F32=0,\"\",JunioriZáp!F32)","v":""},{"$f":"IF(JunioriZáp!G32=0,\"\",JunioriZáp!G32)","v":""},{"$f":"IF(JunioriZáp!H32=\"\",\"\",JunioriZáp!H32)","v":""},{"$f":"IF(JunioriZáp!I32=0,\"\",JunioriZáp!I32)","v":""},{"$f":"JunioriZáp!K32","v":"nie"}]
[null,"30.",{"$f":"IF(JunioriZáp!C33=0,\"\",JunioriZáp!C33)","v":""},{"$f":"IF(JunioriZáp!D33=0,\"\",JunioriZáp!D33)","v":""},{"$f":"IF(JunioriZáp!E33=0,\"\",JunioriZáp!E33)","v":""},{"$f":"IF(JunioriZáp!F33=0,\"\",JunioriZáp!F33)","v":""},{"$f":"IF(JunioriZáp!G33=0,\"\",JunioriZáp!G33)","v":""},{"$f":"IF(JunioriZáp!H33=\"\",\"\",JunioriZáp!H33)","v":""},{"$f":"IF(JunioriZáp!I33=0,\"\",JunioriZáp!I33)","v":""},{"$f":"JunioriZáp!K33","v":"nie"}]
[null,"31.",{"$f":"IF(JunioriZáp!C34=0,\"\",JunioriZáp!C34)","v":""},{"$f":"IF(JunioriZáp!D34=0,\"\",JunioriZáp!D34)","v":""},{"$f":"IF(JunioriZáp!E34=0,\"\",JunioriZáp!E34)","v":""},{"$f":"IF(JunioriZáp!F34=0,\"\",JunioriZáp!F34)","v":""},{"$f":"IF(JunioriZáp!G34=0,\"\",JunioriZáp!G34)","v":""},{"$f":"IF(JunioriZáp!H34=\"\",\"\",JunioriZáp!H34)","v":""},{"$f":"IF(JunioriZáp!I34=0,\"\",JunioriZáp!I34)","v":""},{"$f":"JunioriZáp!K34","v":"nie"}]
[null,"32.",{"$f":"IF(JunioriZáp!C35=0,\"\",JunioriZáp!C35)","v":""},{"$f":"IF(JunioriZáp!D35=0,\"\",JunioriZáp!D35)","v":""},{"$f":"IF(JunioriZáp!E35=0,\"\",JunioriZáp!E35)","v":""},{"$f":"IF(JunioriZáp!F35=0,\"\",JunioriZáp!F35)","v":""},{"$f":"IF(JunioriZáp!G35=0,\"\",JunioriZáp!G35)","v":""},{"$f":"IF(JunioriZáp!H35=\"\",\"\",JunioriZáp!H35)","v":""},{"$f":"IF(JunioriZáp!I35=0,\"\",JunioriZáp!I35)","v":""},{"$f":"JunioriZáp!K35","v":"nie"}]
[null,"33.",{"$f":"IF(JunioriZáp!C36=0,\"\",JunioriZáp!C36)","v":""},{"$f":"IF(JunioriZáp!D36=0,\"\",JunioriZáp!D36)","v":""},{"$f":"IF(JunioriZáp!E36=0,\"\",JunioriZáp!E36)","v":""},{"$f":"IF(JunioriZáp!F36=0,\"\",JunioriZáp!F36)","v":""},{"$f":"IF(JunioriZáp!G36=0,\"\",JunioriZáp!G36)","v":""},{"$f":"IF(JunioriZáp!H36=\"\",\"\",JunioriZáp!H36)","v":""},{"$f":"IF(JunioriZáp!I36=0,\"\",JunioriZáp!I36)","v":""},{"$f":"JunioriZáp!K36","v":"nie"}]
[null,"34.",{"$f":"IF(JunioriZáp!C37=0,\"\",JunioriZáp!C37)","v":""},{"$f":"IF(JunioriZáp!D37=0,\"\",JunioriZáp!D37)","v":""},{"$f":"IF(JunioriZáp!E37=0,\"\",JunioriZáp!E37)","v":""},{"$f":"IF(JunioriZáp!F37=0,\"\",JunioriZáp!F37)","v":""},{"$f":"IF(JunioriZáp!G37=0,\"\",JunioriZáp!G37)","v":""},{"$f":"IF(JunioriZáp!H37=\"\",\"\",JunioriZáp!H37)","v":""},{"$f":"IF(JunioriZáp!I37=0,\"\",JunioriZáp!I37)","v":""},{"$f":"JunioriZáp!K37","v":"nie"}]
[null,"35.",{"$f":"IF(JunioriZáp!C38=0,\"\",JunioriZáp!C38)","v":""},{"$f":"IF(JunioriZáp!D38=0,\"\",JunioriZáp!D38)","v":""},{"$f":"IF(JunioriZáp!E38=0,\"\",JunioriZáp!E38)","v":""},{"$f":"IF(JunioriZáp!F38=0,\"\",JunioriZáp!F38)","v":""},{"$f":"IF(JunioriZáp!G38=0,\"\",JunioriZáp!G38)","v":""},{"$f":"IF(JunioriZáp!H38=\"\",\"\",JunioriZáp!H38)","v":""},{"$f":"IF(JunioriZáp!I38=0,\"\",JunioriZáp!I38)","v":""},{"$f":"JunioriZáp!K38","v":"nie"}]
[null,"36.",{"$f":"IF(JunioriZáp!C39=0,\"\",JunioriZáp!C39)","v":""},{"$f":"IF(JunioriZáp!D39=0,\"\",JunioriZáp!D39)","v":""},{"$f":"IF(JunioriZáp!E39=0,\"\",JunioriZáp!E39)","v":""},{"$f":"IF(JunioriZáp!F39=0,\"\",JunioriZáp!F39)","v":""},{"$f":"IF(JunioriZáp!G39=0,\"\",JunioriZáp!G39)","v":""},{"$f":"IF(JunioriZáp!H39=\"\",\"\",JunioriZáp!H39)","v":""},{"$f":"IF(JunioriZáp!I39=0,\"\",JunioriZáp!I39)","v":""},{"$f":"JunioriZáp!K39","v":"nie"}]
[null,"37.",{"$f":"IF(JunioriZáp!C40=0,\"\",JunioriZáp!C40)","v":""},{"$f":"IF(JunioriZáp!D40=0,\"\",JunioriZáp!D40)","v":""},{"$f":"IF(JunioriZáp!E40=0,\"\",JunioriZáp!E40)","v":""},{"$f":"IF(JunioriZáp!F40=0,\"\",JunioriZáp!F40)","v":""},{"$f":"IF(JunioriZáp!G40=0,\"\",JunioriZáp!G40)","v":""},{"$f":"IF(JunioriZáp!H40=\"\",\"\",JunioriZáp!H40)","v":""},{"$f":"IF(JunioriZáp!I40=0,\"\",JunioriZáp!I40)","v":""},{"$f":"JunioriZáp!K40","v":"nie"}]
[null,"38.",{"$f":"IF(JunioriZáp!C41=0,\"\",JunioriZáp!C41)","v":""},{"$f":"IF(JunioriZáp!D41=0,\"\",JunioriZáp!D41)","v":""},{"$f":"IF(JunioriZáp!E41=0,\"\",JunioriZáp!E41)","v":""},{"$f":"IF(JunioriZáp!F41=0,\"\",JunioriZáp!F41)","v":""},{"$f":"IF(JunioriZáp!G41=0,\"\",JunioriZáp!G41)","v":""},{"$f":"IF(JunioriZáp!H41=\"\",\"\",JunioriZáp!H41)","v":""},{"$f":"IF(JunioriZáp!I41=0,\"\",JunioriZáp!I41)","v":""},{"$f":"JunioriZáp!K41","v":"nie"}]
[null,"39.",{"$f":"IF(JunioriZáp!C42=0,\"\",JunioriZáp!C42)","v":""},{"$f":"IF(JunioriZáp!D42=0,\"\",JunioriZáp!D42)","v":""},{"$f":"IF(JunioriZáp!E42=0,\"\",JunioriZáp!E42)","v":""},{"$f":"IF(JunioriZáp!F42=0,\"\",JunioriZáp!F42)","v":""},{"$f":"IF(JunioriZáp!G42=0,\"\",JunioriZáp!G42)","v":""},{"$f":"IF(JunioriZáp!H42=\"\",\"\",JunioriZáp!H42)","v":""},{"$f":"IF(JunioriZáp!I42=0,\"\",JunioriZáp!I42)","v":""},{"$f":"JunioriZáp!K42","v":"nie"}]
[null,"40.",{"$f":"IF(JunioriZáp!C43=0,\"\",JunioriZáp!C43)","v":""},{"$f":"IF(JunioriZáp!D43=0,\"\",JunioriZáp!D43)","v":""},{"$f":"IF(JunioriZáp!E43=0,\"\",JunioriZáp!E43)","v":""},{"$f":"IF(JunioriZáp!F43=0,\"\",JunioriZáp!F43)","v":""},{"$f":"IF(JunioriZáp!G43=0,\"\",JunioriZáp!G43)","v":""},{"$f":"IF(JunioriZáp!H43=\"\",\"\",JunioriZáp!H43)","v":""},{"$f":"IF(JunioriZáp!I43=0,\"\",JunioriZáp!I43)","v":""},{"$f":"JunioriZáp!K43","v":"nie"}]
[]
[null,"Kraj :",null,{"$f":"JuniorkyZáp!$F$1","v":"Trenčiansky"},null,null,{"$f":"JuniorkyZáp!$H$2","v":"31.3.2019"}]
[null,"MK junioriek U-23 2019",null,null,"Kolkáreň :",{"$f":"JuniorkyZáp!$E$2","v":"Trenčín"}]
[]
[null,"Por.","Hráči","Č.r.p.","Klub","Plné","Dorážka","Chyby","Spolu"]
[]
[null,"1.",{"$f":"IF(JuniorkyZáp!C4=0,\"\",JuniorkyZáp!C4)","v":"Martinčičová Radka"},{"$f":"IF(JuniorkyZáp!D4=0,\"\",JuniorkyZáp!D4)","v":7713},{"$f":"IF(JuniorkyZáp!E4=0,\"\",JuniorkyZáp!E4)","v":"MKK Stará Turá"},{"$f":"IF(JuniorkyZáp!F4=0,\"\",JuniorkyZáp!F4)","v":349},{"$f":"IF(JuniorkyZáp!G4=0,\"\",JuniorkyZáp!G4)","v":135},{"$f":"IF(JuniorkyZáp!H4=0,\"\",JuniorkyZáp!H4)","v":15},{"$f":"IF(JuniorkyZáp!I4=0,\"\",JuniorkyZáp!I4)","v":484},{"$f":"JuniorkyZáp!K4","v":"áno"}]
[null,"2.",{"$f":"IF(JuniorkyZáp!C5=0,\"\",JuniorkyZáp!C5)","v":"Kováčová Natália"},{"$f":"IF(JuniorkyZáp!D5=0,\"\",JuniorkyZáp!D5)","v":8225},{"$f":"IF(JuniorkyZáp!E5=0,\"\",JuniorkyZáp!E5)","v":"MKK Stará Turá"},{"$f":"IF(JuniorkyZáp!F5=0,\"\",JuniorkyZáp!F5)","v":367},{"$f":"IF(JuniorkyZáp!G5=0,\"\",JuniorkyZáp!G5)","v":171},{"$f":"IF(JuniorkyZáp!H5=0,\"\",JuniorkyZáp!H5)","v":7},{"$f":"IF(JuniorkyZáp!I5=0,\"\",JuniorkyZáp!I5)","v":538},{"$f":"JuniorkyZáp!K5","v":"áno"}]
[null,"3.",{"$f":"IF(JuniorkyZáp!C6=0,\"\",JuniorkyZáp!C6)","v":"Hupčíková Gabriela"},{"$f":"IF(JuniorkyZáp!D6=0,\"\",JuniorkyZáp!D6)","v":596},{"$f":"IF(JuniorkyZáp!E6=0,\"\",JuniorkyZáp!E6)","v":"TKK Trenčín"},{"$f":"IF(JuniorkyZáp!F6=0,\"\",JuniorkyZáp!F6)","v":373},{"$f":"IF(JuniorkyZáp!G6=0,\"\",JuniorkyZáp!G6)","v":185},{"$f":"IF(JuniorkyZáp!H6=0,\"\",JuniorkyZáp!H6)","v":2},{"$f":"IF(JuniorkyZáp!I6=0,\"\",JuniorkyZáp!I6)","v":558},{"$f":"JuniorkyZáp!K6","v":"áno"}]
[null,"4.",{"$f":"IF(JuniorkyZáp!C7=0,\"\",JuniorkyZáp!C7)","v":"Miklovičová Adriana"},{"$f":"IF(JuniorkyZáp!D7=0,\"\",JuniorkyZáp!D7)","v":94},{"$f":"IF(JuniorkyZáp!E7=0,\"\",JuniorkyZáp!E7)","v":"KK Pobedim"},{"$f":"IF(JuniorkyZáp!F7=0,\"\",JuniorkyZáp!F7)","v":356},{"$f":"IF(JuniorkyZáp!G7=0,\"\",JuniorkyZáp!G7)","v":151},{"$f":"IF(JuniorkyZáp!H7=0,\"\",JuniorkyZáp!H7)","v":4},{"$f":"IF(JuniorkyZáp!I7=0,\"\",JuniorkyZáp!I7)","v":507},{"$f":"JuniorkyZáp!K7","v":"áno"}]
[null,"5.",{"$f":"IF(JuniorkyZáp!C8=0,\"\",JuniorkyZáp!C8)","v":"Koreňová Simona"},{"$f":"IF(JuniorkyZáp!D8=0,\"\",JuniorkyZáp!D8)","v":597},{"$f":"IF(JuniorkyZáp!E8=0,\"\",JuniorkyZáp!E8)","v":"TKK Trenčín"},{"$f":"IF(JuniorkyZáp!F8=0,\"\",JuniorkyZáp!F8)","v":""},{"$f":"IF(JuniorkyZáp!G8=0,\"\",JuniorkyZáp!G8)","v":{"$error":"#VALUE!"}},{"$f":"IF(JuniorkyZáp!H8=0,\"\",JuniorkyZáp!H8)","v":""},{"$f":"IF(JuniorkyZáp!I8=0,\"\",JuniorkyZáp!I8)","v":"skreč"},{"$f":"JuniorkyZáp!K8","v":"áno"}]
[null,"6.",{"$f":"IF(JuniorkyZáp!C9=0,\"\",JuniorkyZáp!C9)","v":""},{"$f":"IF(JuniorkyZáp!D9=0,\"\",JuniorkyZáp!D9)","v":""},{"$f":"IF(JuniorkyZáp!E9=0,\"\",JuniorkyZáp!E9)","v":""},{"$f":"IF(JuniorkyZáp!F9=0,\"\",JuniorkyZáp!F9)","v":""},{"$f":"IF(JuniorkyZáp!G9=0,\"\",JuniorkyZáp!G9)","v":""},{"$f":"IF(JuniorkyZáp!H9=0,\"\",JuniorkyZáp!H9)","v":""},{"$f":"IF(JuniorkyZáp!I9=0,\"\",JuniorkyZáp!I9)","v":""},{"$f":"JuniorkyZáp!K9","v":"nie"}]
[null,"7.",{"$f":"IF(JuniorkyZáp!C10=0,\"\",JuniorkyZáp!C10)","v":""},{"$f":"IF(JuniorkyZáp!D10=0,\"\",JuniorkyZáp!D10)","v":""},{"$f":"IF(JuniorkyZáp!E10=0,\"\",JuniorkyZáp!E10)","v":""},{"$f":"IF(JuniorkyZáp!F10=0,\"\",JuniorkyZáp!F10)","v":""},{"$f":"IF(JuniorkyZáp!G10=0,\"\",JuniorkyZáp!G10)","v":""},{"$f":"IF(JuniorkyZáp!H10=0,\"\",JuniorkyZáp!H10)","v":""},{"$f":"IF(JuniorkyZáp!I10=0,\"\",JuniorkyZáp!I10)","v":""},{"$f":"JuniorkyZáp!K10","v":"nie"}]
[null,"8.",{"$f":"IF(JuniorkyZáp!C11=0,\"\",JuniorkyZáp!C11)","v":""},{"$f":"IF(JuniorkyZáp!D11=0,\"\",JuniorkyZáp!D11)","v":""},{"$f":"IF(JuniorkyZáp!E11=0,\"\",JuniorkyZáp!E11)","v":""},{"$f":"IF(JuniorkyZáp!F11=0,\"\",JuniorkyZáp!F11)","v":""},{"$f":"IF(JuniorkyZáp!G11=0,\"\",JuniorkyZáp!G11)","v":""},{"$f":"IF(JuniorkyZáp!H11=0,\"\",JuniorkyZáp!H11)","v":""},{"$f":"IF(JuniorkyZáp!I11=0,\"\",JuniorkyZáp!I11)","v":""},{"$f":"JuniorkyZáp!K11","v":"nie"}]
[null,"9.",{"$f":"IF(JuniorkyZáp!C12=0,\"\",JuniorkyZáp!C12)","v":""},{"$f":"IF(JuniorkyZáp!D12=0,\"\",JuniorkyZáp!D12)","v":""},{"$f":"IF(JuniorkyZáp!E12=0,\"\",JuniorkyZáp!E12)","v":""},{"$f":"IF(JuniorkyZáp!F12=0,\"\",JuniorkyZáp!F12)","v":""},{"$f":"IF(JuniorkyZáp!G12=0,\"\",JuniorkyZáp!G12)","v":""},{"$f":"IF(JuniorkyZáp!H12=0,\"\",JuniorkyZáp!H12)","v":""},{"$f":"IF(JuniorkyZáp!I12=0,\"\",JuniorkyZáp!I12)","v":""},{"$f":"JuniorkyZáp!K12","v":"nie"}]
[null,"10.",{"$f":"IF(JuniorkyZáp!C13=0,\"\",JuniorkyZáp!C13)","v":""},{"$f":"IF(JuniorkyZáp!D13=0,\"\",JuniorkyZáp!D13)","v":""},{"$f":"IF(JuniorkyZáp!E13=0,\"\",JuniorkyZáp!E13)","v":""},{"$f":"IF(JuniorkyZáp!F13=0,\"\",JuniorkyZáp!F13)","v":""},{"$f":"IF(JuniorkyZáp!G13=0,\"\",JuniorkyZáp!G13)","v":""},{"$f":"IF(JuniorkyZáp!H13=0,\"\",JuniorkyZáp!H13)","v":""},{"$f":"IF(JuniorkyZáp!I13=0,\"\",JuniorkyZáp!I13)","v":""},{"$f":"JuniorkyZáp!K13","v":"nie"}]
[null,"11.",{"$f":"IF(JuniorkyZáp!C14=0,\"\",JuniorkyZáp!C14)","v":""},{"$f":"IF(JuniorkyZáp!D14=0,\"\",JuniorkyZáp!D14)","v":""},{"$f":"IF(JuniorkyZáp!E14=0,\"\",JuniorkyZáp!E14)","v":""},{"$f":"IF(JuniorkyZáp!F14=0,\"\",JuniorkyZáp!F14)","v":""},{"$f":"IF(JuniorkyZáp!G14=0,\"\",JuniorkyZáp!G14)","v":""},{"$f":"IF(JuniorkyZáp!H14=0,\"\",JuniorkyZáp!H14)","v":""},{"$f":"IF(JuniorkyZáp!I14=0,\"\",JuniorkyZáp!I14)","v":""},{"$f":"JuniorkyZáp!K14","v":"nie"}]
[null,"12.",{"$f":"IF(JuniorkyZáp!C15=0,\"\",JuniorkyZáp!C15)","v":""},{"$f":"IF(JuniorkyZáp!D15=0,\"\",JuniorkyZáp!D15)","v":""},{"$f":"IF(JuniorkyZáp!E15=0,\"\",JuniorkyZáp!E15)","v":""},{"$f":"IF(JuniorkyZáp!F15=0,\"\",JuniorkyZáp!F15)","v":""},{"$f":"IF(JuniorkyZáp!G15=0,\"\",JuniorkyZáp!G15)","v":""},{"$f":"IF(JuniorkyZáp!H15=0,\"\",JuniorkyZáp!H15)","v":""},{"$f":"IF(JuniorkyZáp!I15=0,\"\",JuniorkyZáp!I15)","v":""},{"$f":"JuniorkyZáp!K15","v":"nie"}]
[null,"13.",{"$f":"IF(JuniorkyZáp!C16=0,\"\",JuniorkyZáp!C16)","v":""},{"$f":"IF(JuniorkyZáp!D16=0,\"\",JuniorkyZáp!D16)","v":""},{"$f":"IF(JuniorkyZáp!E16=0,\"\",JuniorkyZáp!E16)","v":""},{"$f":"IF(JuniorkyZáp!F16=0,\"\",JuniorkyZáp!F16)","v":""},{"$f":"IF(JuniorkyZáp!G16=0,\"\",JuniorkyZáp!G16)","v":""},{"$f":"IF(JuniorkyZáp!H16=0,\"\",JuniorkyZáp!H16)","v":""},{"$f":"IF(JuniorkyZáp!I16=0,\"\",JuniorkyZáp!I16)","v":""},{"$f":"JuniorkyZáp!K16","v":"nie"}]
[null,"14.",{"$f":"IF(JuniorkyZáp!C17=0,\"\",JuniorkyZáp!C17)","v":""},{"$f":"IF(JuniorkyZáp!D17=0,\"\",JuniorkyZáp!D17)","v":""},{"$f":"IF(JuniorkyZáp!E17=0,\"\",JuniorkyZáp!E17)","v":""},{"$f":"IF(JuniorkyZáp!F17=0,\"\",JuniorkyZáp!F17)","v":""},{"$f":"IF(JuniorkyZáp!G17=0,\"\",JuniorkyZáp!G17)","v":""},{"$f":"IF(JuniorkyZáp!H17=0,\"\",JuniorkyZáp!H17)","v":""},{"$f":"IF(JuniorkyZáp!I17=0,\"\",JuniorkyZáp!I17)","v":""},{"$f":"JuniorkyZáp!K17","v":"nie"}]
[null,"15.",{"$f":"IF(JuniorkyZáp!C18=0,\"\",JuniorkyZáp!C18)","v":""},{"$f":"IF(JuniorkyZáp!D18=0,\"\",JuniorkyZáp!D18)","v":""},{"$f":"IF(JuniorkyZáp!E18=0,\"\",JuniorkyZáp!E18)","v":""},{"$f":"IF(JuniorkyZáp!F18=0,\"\",JuniorkyZáp!F18)","v":""},{"$f":"IF(JuniorkyZáp!G18=0,\"\",JuniorkyZáp!G18)","v":""},{"$f":"IF(JuniorkyZáp!H18=0,\"\",JuniorkyZáp!H18)","v":""},{"$f":"IF(JuniorkyZáp!I18=0,\"\",JuniorkyZáp!I18)","v":""},{"$f":"JuniorkyZáp!K18","v":"nie"}]
[null,"16.",{"$f":"IF(JuniorkyZáp!C19=0,\"\",JuniorkyZáp!C19)","v":""},{"$f":"IF(JuniorkyZáp!D19=0,\"\",JuniorkyZáp!D19)","v":""},{"$f":"IF(JuniorkyZáp!E19=0,\"\",JuniorkyZáp!E19)","v":""},{"$f":"IF(JuniorkyZáp!F19=0,\"\",JuniorkyZáp!F19)","v":""},{"$f":"IF(JuniorkyZáp!G19=0,\"\",JuniorkyZáp!G19)","v":""},{"$f":"IF(JuniorkyZáp!H19=0,\"\",JuniorkyZáp!H19)","v":""},{"$f":"IF(JuniorkyZáp!I19=0,\"\",JuniorkyZáp!I19)","v":""},{"$f":"JuniorkyZáp!K19","v":"nie"}]
[null,"17.",{"$f":"IF(JuniorkyZáp!C20=0,\"\",JuniorkyZáp!C20)","v":""},{"$f":"IF(JuniorkyZáp!D20=0,\"\",JuniorkyZáp!D20)","v":""},{"$f":"IF(JuniorkyZáp!E20=0,\"\",JuniorkyZáp!E20)","v":""},{"$f":"IF(JuniorkyZáp!F20=0,\"\",JuniorkyZáp!F20)","v":""},{"$f":"IF(JuniorkyZáp!G20=0,\"\",JuniorkyZáp!G20)","v":""},{"$f":"IF(JuniorkyZáp!H20=0,\"\",JuniorkyZáp!H20)","v":""},{"$f":"IF(JuniorkyZáp!I20=0,\"\",JuniorkyZáp!I20)","v":""},{"$f":"JuniorkyZáp!K20","v":"nie"}]
[null,"18.",{"$f":"IF(JuniorkyZáp!C21=0,\"\",JuniorkyZáp!C21)","v":""},{"$f":"IF(JuniorkyZáp!D21=0,\"\",JuniorkyZáp!D21)","v":""},{"$f":"IF(JuniorkyZáp!E21=0,\"\",JuniorkyZáp!E21)","v":""},{"$f":"IF(JuniorkyZáp!F21=0,\"\",JuniorkyZáp!F21)","v":""},{"$f":"IF(JuniorkyZáp!G21=0,\"\",JuniorkyZáp!G21)","v":""},{"$f":"IF(JuniorkyZáp!H21=0,\"\",JuniorkyZáp!H21)","v":""},{"$f":"IF(JuniorkyZáp!I21=0,\"\",JuniorkyZáp!I21)","v":""},{"$f":"JuniorkyZáp!K21","v":"nie"}]
[null,"19.",{"$f":"IF(JuniorkyZáp!C22=0,\"\",JuniorkyZáp!C22)","v":""},{"$f":"IF(JuniorkyZáp!D22=0,\"\",JuniorkyZáp!D22)","v":""},{"$f":"IF(JuniorkyZáp!E22=0,\"\",JuniorkyZáp!E22)","v":""},{"$f":"IF(JuniorkyZáp!F22=0,\"\",JuniorkyZáp!F22)","v":""},{"$f":"IF(JuniorkyZáp!G22=0,\"\",JuniorkyZáp!G22)","v":""},{"$f":"IF(JuniorkyZáp!H22=0,\"\",JuniorkyZáp!H22)","v":""},{"$f":"IF(JuniorkyZáp!I22=0,\"\",JuniorkyZáp!I22)","v":""},{"$f":"JuniorkyZáp!K22","v":"nie"}]
[null,"20.",{"$f":"IF(JuniorkyZáp!C23=0,\"\",JuniorkyZáp!C23)","v":""},{"$f":"IF(JuniorkyZáp!D23=0,\"\",JuniorkyZáp!D23)","v":""},{"$f":"IF(JuniorkyZáp!E23=0,\"\",JuniorkyZáp!E23)","v":""},{"$f":"IF(JuniorkyZáp!F23=0,\"\",JuniorkyZáp!F23)","v":""},{"$f":"IF(JuniorkyZáp!G23=0,\"\",JuniorkyZáp!G23)","v":""},{"$f":"IF(JuniorkyZáp!H23=0,\"\",JuniorkyZáp!H23)","v":""},{"$f":"IF(JuniorkyZáp!I23=0,\"\",JuniorkyZáp!I23)","v":""},{"$f":"JuniorkyZáp!K23","v":"nie"}]
[null,"21.",{"$f":"IF(JuniorkyZáp!C24=0,\"\",JuniorkyZáp!C24)","v":""},{"$f":"IF(JuniorkyZáp!D24=0,\"\",JuniorkyZáp!D24)","v":""},{"$f":"IF(JuniorkyZáp!E24=0,\"\",JuniorkyZáp!E24)","v":""},{"$f":"IF(JuniorkyZáp!F24=0,\"\",JuniorkyZáp!F24)","v":""},{"$f":"IF(JuniorkyZáp!G24=0,\"\",JuniorkyZáp!G24)","v":""},{"$f":"IF(JuniorkyZáp!H24=0,\"\",JuniorkyZáp!H24)","v":""},{"$f":"IF(JuniorkyZáp!I24=0,\"\",JuniorkyZáp!I24)","v":""},{"$f":"JuniorkyZáp!K24","v":"nie"}]
[null,"22.",{"$f":"IF(JuniorkyZáp!C25=0,\"\",JuniorkyZáp!C25)","v":""},{"$f":"IF(JuniorkyZáp!D25=0,\"\",JuniorkyZáp!D25)","v":""},{"$f":"IF(JuniorkyZáp!E25=0,\"\",JuniorkyZáp!E25)","v":""},{"$f":"IF(JuniorkyZáp!F25=0,\"\",JuniorkyZáp!F25)","v":""},{"$f":"IF(JuniorkyZáp!G25=0,\"\",JuniorkyZáp!G25)","v":""},{"$f":"IF(JuniorkyZáp!H25=0,\"\",JuniorkyZáp!H25)","v":""},{"$f":"IF(JuniorkyZáp!I25=0,\"\",JuniorkyZáp!I25)","v":""},{"$f":"JuniorkyZáp!K25","v":"nie"}]
[null,"23.",{"$f":"IF(JuniorkyZáp!C26=0,\"\",JuniorkyZáp!C26)","v":""},{"$f":"IF(JuniorkyZáp!D26=0,\"\",JuniorkyZáp!D26)","v":""},{"$f":"IF(JuniorkyZáp!E26=0,\"\",JuniorkyZáp!E26)","v":""},{"$f":"IF(JuniorkyZáp!F26=0,\"\",JuniorkyZáp!F26)","v":""},{"$f":"IF(JuniorkyZáp!G26=0,\"\",JuniorkyZáp!G26)","v":""},{"$f":"IF(JuniorkyZáp!H26=0,\"\",JuniorkyZáp!H26)","v":""},{"$f":"IF(JuniorkyZáp!I26=0,\"\",JuniorkyZáp!I26)","v":""},{"$f":"JuniorkyZáp!K26","v":"nie"}]
[null,"24.",{"$f":"IF(JuniorkyZáp!C27=0,\"\",JuniorkyZáp!C27)","v":""},{"$f":"IF(JuniorkyZáp!D27=0,\"\",JuniorkyZáp!D27)","v":""},{"$f":"IF(JuniorkyZáp!E27=0,\"\",JuniorkyZáp!E27)","v":""},{"$f":"IF(JuniorkyZáp!F27=0,\"\",JuniorkyZáp!F27)","v":""},{"$f":"IF(JuniorkyZáp!G27=0,\"\",JuniorkyZáp!G27)","v":""},{"$f":"IF(JuniorkyZáp!H27=0,\"\",JuniorkyZáp!H27)","v":""},{"$f":"IF(JuniorkyZáp!I27=0,\"\",JuniorkyZáp!I27)","v":""},{"$f":"JuniorkyZáp!K27","v":"nie"}]
[null,"25.",{"$f":"IF(JuniorkyZáp!C28=0,\"\",JuniorkyZáp!C28)","v":""},{"$f":"IF(JuniorkyZáp!D28=0,\"\",JuniorkyZáp!D28)","v":""},{"$f":"IF(JuniorkyZáp!E28=0,\"\",JuniorkyZáp!E28)","v":""},{"$f":"IF(JuniorkyZáp!F28=0,\"\",JuniorkyZáp!F28)","v":""},{"$f":"IF(JuniorkyZáp!G28=0,\"\",JuniorkyZáp!G28)","v":""},{"$f":"IF(JuniorkyZáp!H28=0,\"\",JuniorkyZáp!H28)","v":""},{"$f":"IF(JuniorkyZáp!I28=0,\"\",JuniorkyZáp!I28)","v":""},{"$f":"JuniorkyZáp!K28","v":"nie"}]
[null,"26.",{"$f":"IF(JuniorkyZáp!C29=0,\"\",JuniorkyZáp!C29)","v":""},{"$f":"IF(JuniorkyZáp!D29=0,\"\",JuniorkyZáp!D29)","v":""},{"$f":"IF(JuniorkyZáp!E29=0,\"\",JuniorkyZáp!E29)","v":""},{"$f":"IF(JuniorkyZáp!F29=0,\"\",JuniorkyZáp!F29)","v":""},{"$f":"IF(JuniorkyZáp!G29=0,\"\",JuniorkyZáp!G29)","v":""},{"$f":"IF(JuniorkyZáp!H29=0,\"\",JuniorkyZáp!H29)","v":""},{"$f":"IF(JuniorkyZáp!I29=0,\"\",JuniorkyZáp!I29)","v":""},{"$f":"JuniorkyZáp!K29","v":"nie"}]
[null,"27.",{"$f":"IF(JuniorkyZáp!C30=0,\"\",JuniorkyZáp!C30)","v":""},{"$f":"IF(JuniorkyZáp!D30=0,\"\",JuniorkyZáp!D30)","v":""},{"$f":"IF(JuniorkyZáp!E30=0,\"\",JuniorkyZáp!E30)","v":""},{"$f":"IF(JuniorkyZáp!F30=0,\"\",JuniorkyZáp!F30)","v":""},{"$f":"IF(JuniorkyZáp!G30=0,\"\",JuniorkyZáp!G30)","v":""},{"$f":"IF(JuniorkyZáp!H30=0,\"\",JuniorkyZáp!H30)","v":""},{"$f":"IF(JuniorkyZáp!I30=0,\"\",JuniorkyZáp!I30)","v":""},{"$f":"JuniorkyZáp!K30","v":"nie"}]
[null,"28.",{"$f":"IF(JuniorkyZáp!C31=0,\"\",JuniorkyZáp!C31)","v":""},{"$f":"IF(JuniorkyZáp!D31=0,\"\",JuniorkyZáp!D31)","v":""},{"$f":"IF(JuniorkyZáp!E31=0,\"\",JuniorkyZáp!E31)","v":""},{"$f":"IF(JuniorkyZáp!F31=0,\"\",JuniorkyZáp!F31)","v":""},{"$f":"IF(JuniorkyZáp!G31=0,\"\",JuniorkyZáp!G31)","v":""},{"$f":"IF(JuniorkyZáp!H31=0,\"\",JuniorkyZáp!H31)","v":""},{"$f":"IF(JuniorkyZáp!I31=0,\"\",JuniorkyZáp!I31)","v":""},{"$f":"JuniorkyZáp!K31","v":"nie"}]
[null,"29.",{"$f":"IF(JuniorkyZáp!C32=0,\"\",JuniorkyZáp!C32)","v":""},{"$f":"IF(JuniorkyZáp!D32=0,\"\",JuniorkyZáp!D32)","v":""},{"$f":"IF(JuniorkyZáp!E32=0,\"\",JuniorkyZáp!E32)","v":""},{"$f":"IF(JuniorkyZáp!F32=0,\"\",JuniorkyZáp!F32)","v":""},{"$f":"IF(JuniorkyZáp!G32=0,\"\",JuniorkyZáp!G32)","v":""},{"$f":"IF(JuniorkyZáp!H32=0,\"\",JuniorkyZáp!H32)","v":""},{"$f":"IF(JuniorkyZáp!I32=0,\"\",JuniorkyZáp!I32)","v":""},{"$f":"JuniorkyZáp!K32","v":"nie"}]
[null,"30.",{"$f":"IF(JuniorkyZáp!C33=0,\"\",JuniorkyZáp!C33)","v":""},{"$f":"IF(JuniorkyZáp!D33=0,\"\",JuniorkyZáp!D33)","v":""},{"$f":"IF(JuniorkyZáp!E33=0,\"\",JuniorkyZáp!E33)","v":""},{"$f":"IF(JuniorkyZáp!F33=0,\"\",JuniorkyZáp!F33)","v":""},{"$f":"IF(JuniorkyZáp!G33=0,\"\",JuniorkyZáp!G33)","v":""},{"$f":"IF(JuniorkyZáp!H33=0,\"\",JuniorkyZáp!H33)","v":""},{"$f":"IF(JuniorkyZáp!I33=0,\"\",JuniorkyZáp!I33)","v":""},{"$f":"JuniorkyZáp!K33","v":"nie"}]
[]
[null,"Kraj :",null,{"$f":"DorciZáp!$F$1","v":"Trenčiansky"},null,null,{"$f":"DorciZáp!$H$2","v":"20.1.2019"}]
[null,"MK dorastencov U-18 2019",null,null,"Kolkáreň :",{"$f":"DorciZáp!$E$2","v":"Stará Turá"}]
[]
[null,"Por.","Hráči","Č.r.p.","Klub","Plné","Dorážka","Chyby","Spolu"]
[]
[null,"1.",{"$f":"IF(DorciZáp!C5=0,\"\",DorciZáp!C5)","v":"Malíček Michal"},{"$f":"IF(DorciZáp!D5=0,\"\",DorciZáp!D5)","v":1074},{"$f":"IF(DorciZáp!E5=0,\"\",DorciZáp!E5)","v":"KK Pobedím"},{"$f":"IF(DorciZáp!F5=0,\"\",DorciZáp!F5)","v":415},{"$f":"IF(DorciZáp!G5=0,\"\",DorciZáp!G5)","v":159},{"$f":"IF(DorciZáp!H5=\"\",\"\",DorciZáp!H5)","v":5},{"$f":"IF(DorciZáp!I5=0,\"\",DorciZáp!I5)","v":574},{"$f":"DorciZáp!K5","v":"áno"}]
[null,"2.",{"$f":"IF(DorciZáp!C7=0,\"\",DorciZáp!C7)","v":"Kotula Matúš"},{"$f":"IF(DorciZáp!D7=0,\"\",DorciZáp!D7)","v":1112},{"$f":"IF(DorciZáp!E7=0,\"\",DorciZáp!E7)","v":"MKK Stará Turá"},{"$f":"IF(DorciZáp!F7=0,\"\",DorciZáp!F7)","v":366},{"$f":"IF(DorciZáp!G7=0,\"\",DorciZáp!G7)","v":204},{"$f":"IF(DorciZáp!H7=\"\",\"\",DorciZáp!H7)","v":4},{"$f":"IF(DorciZáp!I7=0,\"\",DorciZáp!I7)","v":570},{"$f":"DorciZáp!K7","v":"áno"}]
[null,"3.",{"$f":"IF(DorciZáp!C8=0,\"\",DorciZáp!C8)","v":"Truhlík Dominik"},{"$f":"IF(DorciZáp!D8=0,\"\",DorciZáp!D8)","v":1113},{"$f":"IF(DorciZáp!E8=0,\"\",DorciZáp!E8)","v":"MKK Stará Turá"},{"$f":"IF(DorciZáp!F8=0,\"\",DorciZáp!F8)","v":373},{"$f":"IF(DorciZáp!G8=0,\"\",DorciZáp!G8)","v":179},{"$f":"IF(DorciZáp!H8=\"\",\"\",DorciZáp!H8)","v":8},{"$f":"IF(DorciZáp!I8=0,\"\",DorciZáp!I8)","v":552},{"$f":"DorciZáp!K8","v":"áno"}]
[null,"4.",{"$f":"IF(DorciZáp!C4=0,\"\",DorciZáp!C4)","v":"Lehuta Filip"},{"$f":"IF(DorciZáp!D4=0,\"\",DorciZáp!D4)","v":225},{"$f":"IF(DorciZáp!E4=0,\"\",DorciZáp!E4)","v":"MKK Stará Turá"},{"$f":"IF(DorciZáp!F4=0,\"\",DorciZáp!F4)","v":371},{"$f":"IF(DorciZáp!G4=0,\"\",DorciZáp!G4)","v":156},{"$f":"IF(DorciZáp!H4=\"\",\"\",DorciZáp!H4)","v":17},{"$f":"IF(DorciZáp!I4=0,\"\",DorciZáp!I4)","v":527},{"$f":"DorciZáp!K4","v":"áno"}]
[null,"5.",{"$f":"IF(DorciZáp!C6=0,\"\",DorciZáp!C6)","v":"Holota Matúš"},{"$f":"IF(DorciZáp!D6=0,\"\",DorciZáp!D6)","v":1114},{"$f":"IF(DorciZáp!E6=0,\"\",DorciZáp!E6)","v":"MKK Stará Turá"},{"$f":"IF(DorciZáp!F6=0,\"\",DorciZáp!F6)","v":355},{"$f":"IF(DorciZáp!G6=0,\"\",DorciZáp!G6)","v":146},{"$f":"IF(DorciZáp!H6=\"\",\"\",DorciZáp!H6)","v":9},{"$f":"IF(DorciZáp!I6=0,\"\",DorciZáp!I6)","v":501},{"$f":"DorciZáp!K6","v":"áno"}]
[null,"6.",{"$f":"IF(DorciZáp!C9=0,\"\",DorciZáp!C9)","v":""},{"$f":"IF(DorciZáp!D9=0,\"\",DorciZáp!D9)","v":""},{"$f":"IF(DorciZáp!E9=0,\"\",DorciZáp!E9)","v":""},{"$f":"IF(DorciZáp!F9=0,\"\",DorciZáp!F9)","v":""},{"$f":"IF(DorciZáp!G9=0,\"\",DorciZáp!G9)","v":""},{"$f":"IF(DorciZáp!H9=\"\",\"\",DorciZáp!H9)","v":""},{"$f":"IF(DorciZáp!I9=0,\"\",DorciZáp!I9)","v":""},{"$f":"DorciZáp!K9","v":"nie"}]
[null,"7.",{"$f":"IF(DorciZáp!C10=0,\"\",DorciZáp!C10)","v":""},{"$f":"IF(DorciZáp!D10=0,\"\",DorciZáp!D10)","v":""},{"$f":"IF(DorciZáp!E10=0,\"\",DorciZáp!E10)","v":""},{"$f":"IF(DorciZáp!F10=0,\"\",DorciZáp!F10)","v":""},{"$f":"IF(DorciZáp!G10=0,\"\",DorciZáp!G10)","v":""},{"$f":"IF(DorciZáp!H10=\"\",\"\",DorciZáp!H10)","v":""},{"$f":"IF(DorciZáp!I10=0,\"\",DorciZáp!I10)","v":""},{"$f":"DorciZáp!K10","v":"nie"}]
[null,"8.",{"$f":"IF(DorciZáp!C11=0,\"\",DorciZáp!C11)","v":""},{"$f":"IF(DorciZáp!D11=0,\"\",DorciZáp!D11)","v":""},{"$f":"IF(DorciZáp!E11=0,\"\",DorciZáp!E11)","v":""},{"$f":"IF(DorciZáp!F11=0,\"\",DorciZáp!F11)","v":""},{"$f":"IF(DorciZáp!G11=0,\"\",DorciZáp!G11)","v":""},{"$f":"IF(DorciZáp!H11=\"\",\"\",DorciZáp!H11)","v":""},{"$f":"IF(DorciZáp!I11=0,\"\",DorciZáp!I11)","v":""},{"$f":"DorciZáp!K11","v":"nie"}]
[null,"9.",{"$f":"IF(DorciZáp!C12=0,\"\",DorciZáp!C12)","v":""},{"$f":"IF(DorciZáp!D12=0,\"\",DorciZáp!D12)","v":""},{"$f":"IF(DorciZáp!E12=0,\"\",DorciZáp!E12)","v":""},{"$f":"IF(DorciZáp!F12=0,\"\",DorciZáp!F12)","v":""},{"$f":"IF(DorciZáp!G12=0,\"\",DorciZáp!G12)","v":""},{"$f":"IF(DorciZáp!H12=\"\",\"\",DorciZáp!H12)","v":""},{"$f":"IF(DorciZáp!I12=0,\"\",DorciZáp!I12)","v":""},{"$f":"DorciZáp!K12","v":"nie"}]
[null,"10.",{"$f":"IF(DorciZáp!C13=0,\"\",DorciZáp!C13)","v":""},{"$f":"IF(DorciZáp!D13=0,\"\",DorciZáp!D13)","v":""},{"$f":"IF(DorciZáp!E13=0,\"\",DorciZáp!E13)","v":""},{"$f":"IF(DorciZáp!F13=0,\"\",DorciZáp!F13)","v":""},{"$f":"IF(DorciZáp!G13=0,\"\",DorciZáp!G13)","v":""},{"$f":"IF(DorciZáp!H13=\"\",\"\",DorciZáp!H13)","v":""},{"$f":"IF(DorciZáp!I13=0,\"\",DorciZáp!I13)","v":""},{"$f":"DorciZáp!K13","v":"nie"}]
[null,"11.",{"$f":"IF(DorciZáp!C14=0,\"\",DorciZáp!C14)","v":""},{"$f":"IF(DorciZáp!D14=0,\"\",DorciZáp!D14)","v":""},{"$f":"IF(DorciZáp!E14=0,\"\",DorciZáp!E14)","v":""},{"$f":"IF(DorciZáp!F14=0,\"\",DorciZáp!F14)","v":""},{"$f":"IF(DorciZáp!G14=0,\"\",DorciZáp!G14)","v":""},{"$f":"IF(DorciZáp!H14=\"\",\"\",DorciZáp!H14)","v":""},{"$f":"IF(DorciZáp!I14=0,\"\",DorciZáp!I14)","v":""},{"$f":"DorciZáp!K14","v":"nie"}]
[null,"12.",{"$f":"IF(DorciZáp!C15=0,\"\",DorciZáp!C15)","v":""},{"$f":"IF(DorciZáp!D15=0,\"\",DorciZáp!D15)","v":""},{"$f":"IF(DorciZáp!E15=0,\"\",DorciZáp!E15)","v":""},{"$f":"IF(DorciZáp!F15=0,\"\",DorciZáp!F15)","v":""},{"$f":"IF(DorciZáp!G15=0,\"\",DorciZáp!G15)","v":""},{"$f":"IF(DorciZáp!H15=\"\",\"\",DorciZáp!H15)","v":""},{"$f":"IF(DorciZáp!I15=0,\"\",DorciZáp!I15)","v":""},{"$f":"DorciZáp!K15","v":"nie"}]
[null,"13.",{"$f":"IF(DorciZáp!C16=0,\"\",DorciZáp!C16)","v":""},{"$f":"IF(DorciZáp!D16=0,\"\",DorciZáp!D16)","v":""},{"$f":"IF(DorciZáp!E16=0,\"\",DorciZáp!E16)","v":""},{"$f":"IF(DorciZáp!F16=0,\"\",DorciZáp!F16)","v":""},{"$f":"IF(DorciZáp!G16=0,\"\",DorciZáp!G16)","v":""},{"$f":"IF(DorciZáp!H16=\"\",\"\",DorciZáp!H16)","v":""},{"$f":"IF(DorciZáp!I16=0,\"\",DorciZáp!I16)","v":""},{"$f":"DorciZáp!K16","v":"nie"}]
[null,"14.",{"$f":"IF(DorciZáp!C17=0,\"\",DorciZáp!C17)","v":""},{"$f":"IF(DorciZáp!D17=0,\"\",DorciZáp!D17)","v":""},{"$f":"IF(DorciZáp!E17=0,\"\",DorciZáp!E17)","v":""},{"$f":"IF(DorciZáp!F17=0,\"\",DorciZáp!F17)","v":""},{"$f":"IF(DorciZáp!G17=0,\"\",DorciZáp!G17)","v":""},{"$f":"IF(DorciZáp!H17=\"\",\"\",DorciZáp!H17)","v":""},{"$f":"IF(DorciZáp!I17=0,\"\",DorciZáp!I17)","v":""},{"$f":"DorciZáp!K17","v":"nie"}]
[null,"15.",{"$f":"IF(DorciZáp!C18=0,\"\",DorciZáp!C18)","v":""},{"$f":"IF(DorciZáp!D18=0,\"\",DorciZáp!D18)","v":""},{"$f":"IF(DorciZáp!E18=0,\"\",DorciZáp!E18)","v":""},{"$f":"IF(DorciZáp!F18=0,\"\",DorciZáp!F18)","v":""},{"$f":"IF(DorciZáp!G18=0,\"\",DorciZáp!G18)","v":""},{"$f":"IF(DorciZáp!H18=\"\",\"\",DorciZáp!H18)","v":""},{"$f":"IF(DorciZáp!I18=0,\"\",DorciZáp!I18)","v":""},{"$f":"DorciZáp!K18","v":"nie"}]
[null,"16.",{"$f":"IF(DorciZáp!C19=0,\"\",DorciZáp!C19)","v":""},{"$f":"IF(DorciZáp!D19=0,\"\",DorciZáp!D19)","v":""},{"$f":"IF(DorciZáp!E19=0,\"\",DorciZáp!E19)","v":""},{"$f":"IF(DorciZáp!F19=0,\"\",DorciZáp!F19)","v":""},{"$f":"IF(DorciZáp!G19=0,\"\",DorciZáp!G19)","v":""},{"$f":"IF(DorciZáp!H19=\"\",\"\",DorciZáp!H19)","v":""},{"$f":"IF(DorciZáp!I19=0,\"\",DorciZáp!I19)","v":""},{"$f":"DorciZáp!K19","v":"nie"}]
[null,"17.",{"$f":"IF(DorciZáp!C20=0,\"\",DorciZáp!C20)","v":""},{"$f":"IF(DorciZáp!D20=0,\"\",DorciZáp!D20)","v":""},{"$f":"IF(DorciZáp!E20=0,\"\",DorciZáp!E20)","v":""},{"$f":"IF(DorciZáp!F20=0,\"\",DorciZáp!F20)","v":""},{"$f":"IF(DorciZáp!G20=0,\"\",DorciZáp!G20)","v":""},{"$f":"IF(DorciZáp!H20=\"\",\"\",DorciZáp!H20)","v":""},{"$f":"IF(DorciZáp!I20=0,\"\",DorciZáp!I20)","v":""},{"$f":"DorciZáp!K20","v":"nie"}]
[null,"18.",{"$f":"IF(DorciZáp!C21=0,\"\",DorciZáp!C21)","v":""},{"$f":"IF(DorciZáp!D21=0,\"\",DorciZáp!D21)","v":""},{"$f":"IF(DorciZáp!E21=0,\"\",DorciZáp!E21)","v":""},{"$f":"IF(DorciZáp!F21=0,\"\",DorciZáp!F21)","v":""},{"$f":"IF(DorciZáp!G21=0,\"\",DorciZáp!G21)","v":""},{"$f":"IF(DorciZáp!H21=\"\",\"\",DorciZáp!H21)","v":""},{"$f":"IF(DorciZáp!I21=0,\"\",DorciZáp!I21)","v":""},{"$f":"DorciZáp!K21","v":"nie"}]
[null,"19.",{"$f":"IF(DorciZáp!C22=0,\"\",DorciZáp!C22)","v":""},{"$f":"IF(DorciZáp!D22=0,\"\",DorciZáp!D22)","v":""},{"$f":"IF(DorciZáp!E22=0,\"\",DorciZáp!E22)","v":""},{"$f":"IF(DorciZáp!F22=0,\"\",DorciZáp!F22)","v":""},{"$f":"IF(DorciZáp!G22=0,\"\",DorciZáp!G22)","v":""},{"$f":"IF(DorciZáp!H22=\"\",\"\",DorciZáp!H22)","v":""},{"$f":"IF(DorciZáp!I22=0,\"\",DorciZáp!I22)","v":""},{"$f":"DorciZáp!K22","v":"nie"}]
[null,"20.",{"$f":"IF(DorciZáp!C23=0,\"\",DorciZáp!C23)","v":""},{"$f":"IF(DorciZáp!D23=0,\"\",DorciZáp!D23)","v":""},{"$f":"IF(DorciZáp!E23=0,\"\",DorciZáp!E23)","v":""},{"$f":"IF(DorciZáp!F23=0,\"\",DorciZáp!F23)","v":""},{"$f":"IF(DorciZáp!G23=0,\"\",DorciZáp!G23)","v":""},{"$f":"IF(DorciZáp!H23=\"\",\"\",DorciZáp!H23)","v":""},{"$f":"IF(DorciZáp!I23=0,\"\",DorciZáp!I23)","v":""},{"$f":"DorciZáp!K23","v":"nie"}]
[null,"21.",{"$f":"IF(DorciZáp!C24=0,\"\",DorciZáp!C24)","v":""},{"$f":"IF(DorciZáp!D24=0,\"\",DorciZáp!D24)","v":""},{"$f":"IF(DorciZáp!E24=0,\"\",DorciZáp!E24)","v":""},{"$f":"IF(DorciZáp!F24=0,\"\",DorciZáp!F24)","v":""},{"$f":"IF(DorciZáp!G24=0,\"\",DorciZáp!G24)","v":""},{"$f":"IF(DorciZáp!H24=\"\",\"\",DorciZáp!H24)","v":""},{"$f":"IF(DorciZáp!I24=0,\"\",DorciZáp!I24)","v":""},{"$f":"DorciZáp!K24","v":"nie"}]
[null,"22.",{"$f":"IF(DorciZáp!C25=0,\"\",DorciZáp!C25)","v":""},{"$f":"IF(DorciZáp!D25=0,\"\",DorciZáp!D25)","v":""},{"$f":"IF(DorciZáp!E25=0,\"\",DorciZáp!E25)","v":""},{"$f":"IF(DorciZáp!F25=0,\"\",DorciZáp!F25)","v":""},{"$f":"IF(DorciZáp!G25=0,\"\",DorciZáp!G25)","v":""},{"$f":"IF(DorciZáp!H25=\"\",\"\",DorciZáp!H25)","v":""},{"$f":"IF(DorciZáp!I25=0,\"\",DorciZáp!I25)","v":""},{"$f":"DorciZáp!K25","v":"nie"}]
[null,"23.",{"$f":"IF(DorciZáp!C26=0,\"\",DorciZáp!C26)","v":""},{"$f":"IF(DorciZáp!D26=0,\"\",DorciZáp!D26)","v":""},{"$f":"IF(DorciZáp!E26=0,\"\",DorciZáp!E26)","v":""},{"$f":"IF(DorciZáp!F26=0,\"\",DorciZáp!F26)","v":""},{"$f":"IF(DorciZáp!G26=0,\"\",DorciZáp!G26)","v":""},{"$f":"IF(DorciZáp!H26=\"\",\"\",DorciZáp!H26)","v":""},{"$f":"IF(DorciZáp!I26=0,\"\",DorciZáp!I26)","v":""},{"$f":"DorciZáp!K26","v":"nie"}]
[null,"24.",{"$f":"IF(DorciZáp!C27=0,\"\",DorciZáp!C27)","v":""},{"$f":"IF(DorciZáp!D27=0,\"\",DorciZáp!D27)","v":""},{"$f":"IF(DorciZáp!E27=0,\"\",DorciZáp!E27)","v":""},{"$f":"IF(DorciZáp!F27=0,\"\",DorciZáp!F27)","v":""},{"$f":"IF(DorciZáp!G27=0,\"\",DorciZáp!G27)","v":""},{"$f":"IF(DorciZáp!H27=\"\",\"\",DorciZáp!H27)","v":""},{"$f":"IF(DorciZáp!I27=0,\"\",DorciZáp!I27)","v":""},{"$f":"DorciZáp!K27","v":"nie"}]
[null,"25.",{"$f":"IF(DorciZáp!C28=0,\"\",DorciZáp!C28)","v":""},{"$f":"IF(DorciZáp!D28=0,\"\",DorciZáp!D28)","v":""},{"$f":"IF(DorciZáp!E28=0,\"\",DorciZáp!E28)","v":""},{"$f":"IF(DorciZáp!F28=0,\"\",DorciZáp!F28)","v":""},{"$f":"IF(DorciZáp!G28=0,\"\",DorciZáp!G28)","v":""},{"$f":"IF(DorciZáp!H28=\"\",\"\",DorciZáp!H28)","v":""},{"$f":"IF(DorciZáp!I28=0,\"\",DorciZáp!I28)","v":""},{"$f":"DorciZáp!K28","v":"nie"}]
[null,"26.",{"$f":"IF(DorciZáp!C29=0,\"\",DorciZáp!C29)","v":""},{"$f":"IF(DorciZáp!D29=0,\"\",DorciZáp!D29)","v":""},{"$f":"IF(DorciZáp!E29=0,\"\",DorciZáp!E29)","v":""},{"$f":"IF(DorciZáp!F29=0,\"\",DorciZáp!F29)","v":""},{"$f":"IF(DorciZáp!G29=0,\"\",DorciZáp!G29)","v":""},{"$f":"IF(DorciZáp!H29=\"\",\"\",DorciZáp!H29)","v":""},{"$f":"IF(DorciZáp!I29=0,\"\",DorciZáp!I29)","v":""},{"$f":"DorciZáp!K29","v":"nie"}]
[null,"27.",{"$f":"IF(DorciZáp!C30=0,\"\",DorciZáp!C30)","v":""},{"$f":"IF(DorciZáp!D30=0,\"\",DorciZáp!D30)","v":""},{"$f":"IF(DorciZáp!E30=0,\"\",DorciZáp!E30)","v":""},{"$f":"IF(DorciZáp!F30=0,\"\",DorciZáp!F30)","v":""},{"$f":"IF(DorciZáp!G30=0,\"\",DorciZáp!G30)","v":""},{"$f":"IF(DorciZáp!H30=\"\",\"\",DorciZáp!H30)","v":""},{"$f":"IF(DorciZáp!I30=0,\"\",DorciZáp!I30)","v":""},{"$f":"DorciZáp!K30","v":"nie"}]
[null,"28.",{"$f":"IF(DorciZáp!C31=0,\"\",DorciZáp!C31)","v":""},{"$f":"IF(DorciZáp!D31=0,\"\",DorciZáp!D31)","v":""},{"$f":"IF(DorciZáp!E31=0,\"\",DorciZáp!E31)","v":""},{"$f":"IF(DorciZáp!F31=0,\"\",DorciZáp!F31)","v":""},{"$f":"IF(DorciZáp!G31=0,\"\",DorciZáp!G31)","v":""},{"$f":"IF(DorciZáp!H31=\"\",\"\",DorciZáp!H31)","v":""},{"$f":"IF(DorciZáp!I31=0,\"\",DorciZáp!I31)","v":""},{"$f":"DorciZáp!K31","v":"nie"}]
[null,"29.",{"$f":"IF(DorciZáp!C32=0,\"\",DorciZáp!C32)","v":""},{"$f":"IF(DorciZáp!D32=0,\"\",DorciZáp!D32)","v":""},{"$f":"IF(DorciZáp!E32=0,\"\",DorciZáp!E32)","v":""},{"$f":"IF(DorciZáp!F32=0,\"\",DorciZáp!F32)","v":""},{"$f":"IF(DorciZáp!G32=0,\"\",DorciZáp!G32)","v":""},{"$f":"IF(DorciZáp!H32=\"\",\"\",DorciZáp!H32)","v":""},{"$f":"IF(DorciZáp!I32=0,\"\",DorciZáp!I32)","v":""},{"$f":"DorciZáp!K32","v":"nie"}]
[null,"30.",{"$f":"IF(DorciZáp!C33=0,\"\",DorciZáp!C33)","v":""},{"$f":"IF(DorciZáp!D33=0,\"\",DorciZáp!D33)","v":""},{"$f":"IF(DorciZáp!E33=0,\"\",DorciZáp!E33)","v":""},{"$f":"IF(DorciZáp!F33=0,\"\",DorciZáp!F33)","v":""},{"$f":"IF(DorciZáp!G33=0,\"\",DorciZáp!G33)","v":""},{"$f":"IF(DorciZáp!H33=\"\",\"\",DorciZáp!H33)","v":""},{"$f":"IF(DorciZáp!I33=0,\"\",DorciZáp!I33)","v":""},{"$f":"DorciZáp!K33","v":"nie"}]
[null,"31.",{"$f":"IF(DorciZáp!C34=0,\"\",DorciZáp!C34)","v":""},{"$f":"IF(DorciZáp!D34=0,\"\",DorciZáp!D34)","v":""},{"$f":"IF(DorciZáp!E34=0,\"\",DorciZáp!E34)","v":""},{"$f":"IF(DorciZáp!F34=0,\"\",DorciZáp!F34)","v":""},{"$f":"IF(DorciZáp!G34=0,\"\",DorciZáp!G34)","v":""},{"$f":"IF(DorciZáp!H34=\"\",\"\",DorciZáp!H34)","v":""},{"$f":"IF(DorciZáp!I34=0,\"\",DorciZáp!I34)","v":""},{"$f":"DorciZáp!K34","v":"nie"}]
[null,"32.",{"$f":"IF(DorciZáp!C35=0,\"\",DorciZáp!C35)","v":""},{"$f":"IF(DorciZáp!D35=0,\"\",DorciZáp!D35)","v":""},{"$f":"IF(DorciZáp!E35=0,\"\",DorciZáp!E35)","v":""},{"$f":"IF(DorciZáp!F35=0,\"\",DorciZáp!F35)","v":""},{"$f":"IF(DorciZáp!G35=0,\"\",DorciZáp!G35)","v":""},{"$f":"IF(DorciZáp!H35=\"\",\"\",DorciZáp!H35)","v":""},{"$f":"IF(DorciZáp!I35=0,\"\",DorciZáp!I35)","v":""},{"$f":"DorciZáp!K35","v":"nie"}]
[null,"33.",{"$f":"IF(DorciZáp!C36=0,\"\",DorciZáp!C36)","v":""},{"$f":"IF(DorciZáp!D36=0,\"\",DorciZáp!D36)","v":""},{"$f":"IF(DorciZáp!E36=0,\"\",DorciZáp!E36)","v":""},{"$f":"IF(DorciZáp!F36=0,\"\",DorciZáp!F36)","v":""},{"$f":"IF(DorciZáp!G36=0,\"\",DorciZáp!G36)","v":""},{"$f":"IF(DorciZáp!H36=\"\",\"\",DorciZáp!H36)","v":""},{"$f":"IF(DorciZáp!I36=0,\"\",DorciZáp!I36)","v":""},{"$f":"DorciZáp!K36","v":"nie"}]
[null,"34.",{"$f":"IF(DorciZáp!C37=0,\"\",DorciZáp!C37)","v":""},{"$f":"IF(DorciZáp!D37=0,\"\",DorciZáp!D37)","v":""},{"$f":"IF(DorciZáp!E37=0,\"\",DorciZáp!E37)","v":""},{"$f":"IF(DorciZáp!F37=0,\"\",DorciZáp!F37)","v":""},{"$f":"IF(DorciZáp!G37=0,\"\",DorciZáp!G37)","v":""},{"$f":"IF(DorciZáp!H37=\"\",\"\",DorciZáp!H37)","v":""},{"$f":"IF(DorciZáp!I37=0,\"\",DorciZáp!I37)","v":""},{"$f":"DorciZáp!K37","v":"nie"}]
[null,"35.",{"$f":"IF(DorciZáp!C38=0,\"\",DorciZáp!C38)","v":""},{"$f":"IF(DorciZáp!D38=0,\"\",DorciZáp!D38)","v":""},{"$f":"IF(DorciZáp!E38=0,\"\",DorciZáp!E38)","v":""},{"$f":"IF(DorciZáp!F38=0,\"\",DorciZáp!F38)","v":""},{"$f":"IF(DorciZáp!G38=0,\"\",DorciZáp!G38)","v":""},{"$f":"IF(DorciZáp!H38=\"\",\"\",DorciZáp!H38)","v":""},{"$f":"IF(DorciZáp!I38=0,\"\",DorciZáp!I38)","v":""},{"$f":"DorciZáp!K38","v":"nie"}]
[null,"36.",{"$f":"IF(DorciZáp!C39=0,\"\",DorciZáp!C39)","v":""},{"$f":"IF(DorciZáp!D39=0,\"\",DorciZáp!D39)","v":""},{"$f":"IF(DorciZáp!E39=0,\"\",DorciZáp!E39)","v":""},{"$f":"IF(DorciZáp!F39=0,\"\",DorciZáp!F39)","v":""},{"$f":"IF(DorciZáp!G39=0,\"\",DorciZáp!G39)","v":""},{"$f":"IF(DorciZáp!H39=\"\",\"\",DorciZáp!H39)","v":""},{"$f":"IF(DorciZáp!I39=0,\"\",DorciZáp!I39)","v":""},{"$f":"DorciZáp!K39","v":"nie"}]
[null,"37.",{"$f":"IF(DorciZáp!C40=0,\"\",DorciZáp!C40)","v":""},{"$f":"IF(DorciZáp!D40=0,\"\",DorciZáp!D40)","v":""},{"$f":"IF(DorciZáp!E40=0,\"\",DorciZáp!E40)","v":""},{"$f":"IF(DorciZáp!F40=0,\"\",DorciZáp!F40)","v":""},{"$f":"IF(DorciZáp!G40=0,\"\",DorciZáp!G40)","v":""},{"$f":"IF(DorciZáp!H40=\"\",\"\",DorciZáp!H40)","v":""},{"$f":"IF(DorciZáp!I40=0,\"\",DorciZáp!I40)","v":""},{"$f":"DorciZáp!K40","v":"nie"}]
[null,"38.",{"$f":"IF(DorciZáp!C41=0,\"\",DorciZáp!C41)","v":""},{"$f":"IF(DorciZáp!D41=0,\"\",DorciZáp!D41)","v":""},{"$f":"IF(DorciZáp!E41=0,\"\",DorciZáp!E41)","v":""},{"$f":"IF(DorciZáp!F41=0,\"\",DorciZáp!F41)","v":""},{"$f":"IF(DorciZáp!G41=0,\"\",DorciZáp!G41)","v":""},{"$f":"IF(DorciZáp!H41=\"\",\"\",DorciZáp!H41)","v":""},{"$f":"IF(DorciZáp!I41=0,\"\",DorciZáp!I41)","v":""},{"$f":"DorciZáp!K41","v":"nie"}]
[null,"39.",{"$f":"IF(DorciZáp!C42=0,\"\",DorciZáp!C42)","v":""},{"$f":"IF(DorciZáp!D42=0,\"\",DorciZáp!D42)","v":""},{"$f":"IF(DorciZáp!E42=0,\"\",DorciZáp!E42)","v":""},{"$f":"IF(DorciZáp!F42=0,\"\",DorciZáp!F42)","v":""},{"$f":"IF(DorciZáp!G42=0,\"\",DorciZáp!G42)","v":""},{"$f":"IF(DorciZáp!H42=\"\",\"\",DorciZáp!H42)","v":""},{"$f":"IF(DorciZáp!I42=0,\"\",DorciZáp!I42)","v":""},{"$f":"DorciZáp!K42","v":"nie"}]
[null,"40.",{"$f":"IF(DorciZáp!C43=0,\"\",DorciZáp!C43)","v":""},{"$f":"IF(DorciZáp!D43=0,\"\",DorciZáp!D43)","v":""},{"$f":"IF(DorciZáp!E43=0,\"\",DorciZáp!E43)","v":""},{"$f":"IF(DorciZáp!F43=0,\"\",DorciZáp!F43)","v":""},{"$f":"IF(DorciZáp!G43=0,\"\",DorciZáp!G43)","v":""},{"$f":"IF(DorciZáp!H43=\"\",\"\",DorciZáp!H43)","v":""},{"$f":"IF(DorciZáp!I43=0,\"\",DorciZáp!I43)","v":""},{"$f":"DorciZáp!K43","v":"nie"}]
[]
[null,"Kraj :",null,{"$f":"DorkyZáp!$F$1","v":"Trenčiansky"},null,null,{"$f":"DorkyZáp!$H$2","v":"20.1.2019"}]
[null,"MK dorasteniek U-18 2019",null,null,"Kolkáreň :",{"$f":"DorkyZáp!$E$2","v":"Trenčín"}]
[]
[null,"Por.","Hráči","Č.r.p.","Klub","Plné","Dorážka","Chyby","Spolu"]
[]
[null,"1.",{"$f":"IF(DorkyZáp!C4=0,\"\",DorkyZáp!C4)","v":"Balajová Karolína"},{"$f":"IF(DorkyZáp!D4=0,\"\",DorkyZáp!D4)","v":8206},{"$f":"IF(DorkyZáp!E4=0,\"\",DorkyZáp!E4)","v":"TKK Trenčín"},{"$f":"IF(DorkyZáp!F4=0,\"\",DorkyZáp!F4)","v":258},{"$f":"IF(DorkyZáp!G4=0,\"\",DorkyZáp!G4)","v":79},{"$f":"IF(DorkyZáp!H4=\"\",\"\",DorkyZáp!H4)","v":33},{"$f":"IF(DorkyZáp!I4=0,\"\",DorkyZáp!I4)","v":337},{"$f":"DorkyZáp!K4","v":"áno"}]
[null,"2.",{"$f":"IF(DorkyZáp!C5=0,\"\",DorkyZáp!C5)","v":"Hupčíková Erika"},{"$f":"IF(DorkyZáp!D5=0,\"\",DorkyZáp!D5)","v":1116},{"$f":"IF(DorkyZáp!E5=0,\"\",DorkyZáp!E5)","v":"TKK Trenčín"},{"$f":"IF(DorkyZáp!F5=0,\"\",DorkyZáp!F5)","v":320},{"$f":"IF(DorkyZáp!G5=0,\"\",DorkyZáp!G5)","v":118},{"$f":"IF(DorkyZáp!H5=\"\",\"\",DorkyZáp!H5)","v":17},{"$f":"IF(DorkyZáp!I5=0,\"\",DorkyZáp!I5)","v":438},{"$f":"DorkyZáp!K5","v":"áno"}]
[null,"3.",{"$f":"IF(DorkyZáp!C6=0,\"\",DorkyZáp!C6)","v":"Vávrová Vladimíra"},{"$f":"IF(DorkyZáp!D6=0,\"\",DorkyZáp!D6)","v":5675},{"$f":"IF(DorkyZáp!E6=0,\"\",DorkyZáp!E6)","v":"Mkk Stará Turá"},{"$f":"IF(DorkyZáp!F6=0,\"\",DorkyZáp!F6)","v":379},{"$f":"IF(DorkyZáp!G6=0,\"\",DorkyZáp!G6)","v":169},{"$f":"IF(DorkyZáp!H6=\"\",\"\",DorkyZáp!H6)","v":6},{"$f":"IF(DorkyZáp!I6=0,\"\",DorkyZáp!I6)","v":548},{"$f":"DorkyZáp!K6","v":"áno"}]
[null,"4.",{"$f":"IF(DorkyZáp!C7=0,\"\",DorkyZáp!C7)","v":"Mikušincová Veronika"},{"$f":"IF(DorkyZáp!D7=0,\"\",DorkyZáp!D7)","v":7802},{"$f":"IF(DorkyZáp!E7=0,\"\",DorkyZáp!E7)","v":"TKK Trenčín"},{"$f":"IF(DorkyZáp!F7=0,\"\",DorkyZáp!F7)","v":340},{"$f":"IF(DorkyZáp!G7=0,\"\",DorkyZáp!G7)","v":173},{"$f":"IF(DorkyZáp!H7=\"\",\"\",DorkyZáp!H7)","v":9},{"$f":"IF(DorkyZáp!I7=0,\"\",DorkyZáp!I7)","v":513},{"$f":"DorkyZáp!K7","v":"áno"}]
[null,"5.",{"$f":"IF(DorkyZáp!C8=0,\"\",DorkyZáp!C8)","v":""},{"$f":"IF(DorkyZáp!D8=0,\"\",DorkyZáp!D8)","v":""},{"$f":"IF(DorkyZáp!E8=0,\"\",DorkyZáp!E8)","v":""},{"$f":"IF(DorkyZáp!F8=0,\"\",DorkyZáp!F8)","v":""},{"$f":"IF(DorkyZáp!G8=0,\"\",DorkyZáp!G8)","v":""},{"$f":"IF(DorkyZáp!H8=\"\",\"\",DorkyZáp!H8)","v":""},{"$f":"IF(DorkyZáp!I8=0,\"\",DorkyZáp!I8)","v":""},{"$f":"DorkyZáp!K8","v":"nie"}]
[null,"6.",{"$f":"IF(DorkyZáp!C9=0,\"\",DorkyZáp!C9)","v":""},{"$f":"IF(DorkyZáp!D9=0,\"\",DorkyZáp!D9)","v":""},{"$f":"IF(DorkyZáp!E9=0,\"\",DorkyZáp!E9)","v":""},{"$f":"IF(DorkyZáp!F9=0,\"\",DorkyZáp!F9)","v":""},{"$f":"IF(DorkyZáp!G9=0,\"\",DorkyZáp!G9)","v":""},{"$f":"IF(DorkyZáp!H9=\"\",\"\",DorkyZáp!H9)","v":""},{"$f":"IF(DorkyZáp!I9=0,\"\",DorkyZáp!I9)","v":""},{"$f":"DorkyZáp!K9","v":"nie"}]
[null,"7.",{"$f":"IF(DorkyZáp!C10=0,\"\",DorkyZáp!C10)","v":""},{"$f":"IF(DorkyZáp!D10=0,\"\",DorkyZáp!D10)","v":""},{"$f":"IF(DorkyZáp!E10=0,\"\",DorkyZáp!E10)","v":""},{"$f":"IF(DorkyZáp!F10=0,\"\",DorkyZáp!F10)","v":""},{"$f":"IF(DorkyZáp!G10=0,\"\",DorkyZáp!G10)","v":""},{"$f":"IF(DorkyZáp!H10=\"\",\"\",DorkyZáp!H10)","v":""},{"$f":"IF(DorkyZáp!I10=0,\"\",DorkyZáp!I10)","v":""},{"$f":"DorkyZáp!K10","v":"nie"}]
[null,"8.",{"$f":"IF(DorkyZáp!C11=0,\"\",DorkyZáp!C11)","v":""},{"$f":"IF(DorkyZáp!D11=0,\"\",DorkyZáp!D11)","v":""},{"$f":"IF(DorkyZáp!E11=0,\"\",DorkyZáp!E11)","v":""},{"$f":"IF(DorkyZáp!F11=0,\"\",DorkyZáp!F11)","v":""},{"$f":"IF(DorkyZáp!G11=0,\"\",DorkyZáp!G11)","v":""},{"$f":"IF(DorkyZáp!H11=\"\",\"\",DorkyZáp!H11)","v":""},{"$f":"IF(DorkyZáp!I11=0,\"\",DorkyZáp!I11)","v":""},{"$f":"DorkyZáp!K11","v":"nie"}]
[null,"9.",{"$f":"IF(DorkyZáp!C12=0,\"\",DorkyZáp!C12)","v":""},{"$f":"IF(DorkyZáp!D12=0,\"\",DorkyZáp!D12)","v":""},{"$f":"IF(DorkyZáp!E12=0,\"\",DorkyZáp!E12)","v":""},{"$f":"IF(DorkyZáp!F12=0,\"\",DorkyZáp!F12)","v":""},{"$f":"IF(DorkyZáp!G12=0,\"\",DorkyZáp!G12)","v":""},{"$f":"IF(DorkyZáp!H12=\"\",\"\",DorkyZáp!H12)","v":""},{"$f":"IF(DorkyZáp!I12=0,\"\",DorkyZáp!I12)","v":""},{"$f":"DorkyZáp!K12","v":"nie"}]
[null,"10.",{"$f":"IF(DorkyZáp!C13=0,\"\",DorkyZáp!C13)","v":""},{"$f":"IF(DorkyZáp!D13=0,\"\",DorkyZáp!D13)","v":""},{"$f":"IF(DorkyZáp!E13=0,\"\",DorkyZáp!E13)","v":""},{"$f":"IF(DorkyZáp!F13=0,\"\",DorkyZáp!F13)","v":""},{"$f":"IF(DorkyZáp!G13=0,\"\",DorkyZáp!G13)","v":""},{"$f":"IF(DorkyZáp!H13=\"\",\"\",DorkyZáp!H13)","v":""},{"$f":"IF(DorkyZáp!I13=0,\"\",DorkyZáp!I13)","v":""},{"$f":"DorkyZáp!K13","v":"nie"}]
[null,"11.",{"$f":"IF(DorkyZáp!C14=0,\"\",DorkyZáp!C14)","v":""},{"$f":"IF(DorkyZáp!D14=0,\"\",DorkyZáp!D14)","v":""},{"$f":"IF(DorkyZáp!E14=0,\"\",DorkyZáp!E14)","v":""},{"$f":"IF(DorkyZáp!F14=0,\"\",DorkyZáp!F14)","v":""},{"$f":"IF(DorkyZáp!G14=0,\"\",DorkyZáp!G14)","v":""},{"$f":"IF(DorkyZáp!H14=\"\",\"\",DorkyZáp!H14)","v":""},{"$f":"IF(DorkyZáp!I14=0,\"\",DorkyZáp!I14)","v":""},{"$f":"DorkyZáp!K14","v":"nie"}]
[null,"12.",{"$f":"IF(DorkyZáp!C15=0,\"\",DorkyZáp!C15)","v":""},{"$f":"IF(DorkyZáp!D15=0,\"\",DorkyZáp!D15)","v":""},{"$f":"IF(DorkyZáp!E15=0,\"\",DorkyZáp!E15)","v":""},{"$f":"IF(DorkyZáp!F15=0,\"\",DorkyZáp!F15)","v":""},{"$f":"IF(DorkyZáp!G15=0,\"\",DorkyZáp!G15)","v":""},{"$f":"IF(DorkyZáp!H15=\"\",\"\",DorkyZáp!H15)","v":""},{"$f":"IF(DorkyZáp!I15=0,\"\",DorkyZáp!I15)","v":""},{"$f":"DorkyZáp!K15","v":"nie"}]
[null,"13.",{"$f":"IF(DorkyZáp!C16=0,\"\",DorkyZáp!C16)","v":""},{"$f":"IF(DorkyZáp!D16=0,\"\",DorkyZáp!D16)","v":""},{"$f":"IF(DorkyZáp!E16=0,\"\",DorkyZáp!E16)","v":""},{"$f":"IF(DorkyZáp!F16=0,\"\",DorkyZáp!F16)","v":""},{"$f":"IF(DorkyZáp!G16=0,\"\",DorkyZáp!G16)","v":""},{"$f":"IF(DorkyZáp!H16=\"\",\"\",DorkyZáp!H16)","v":""},{"$f":"IF(DorkyZáp!I16=0,\"\",DorkyZáp!I16)","v":""},{"$f":"DorkyZáp!K16","v":"nie"}]
[null,"14.",{"$f":"IF(DorkyZáp!C17=0,\"\",DorkyZáp!C17)","v":""},{"$f":"IF(DorkyZáp!D17=0,\"\",DorkyZáp!D17)","v":""},{"$f":"IF(DorkyZáp!E17=0,\"\",DorkyZáp!E17)","v":""},{"$f":"IF(DorkyZáp!F17=0,\"\",DorkyZáp!F17)","v":""},{"$f":"IF(DorkyZáp!G17=0,\"\",DorkyZáp!G17)","v":""},{"$f":"IF(DorkyZáp!H17=\"\",\"\",DorkyZáp!H17)","v":""},{"$f":"IF(DorkyZáp!I17=0,\"\",DorkyZáp!I17)","v":""},{"$f":"DorkyZáp!K17","v":"nie"}]
[null,"15.",{"$f":"IF(DorkyZáp!C18=0,\"\",DorkyZáp!C18)","v":""},{"$f":"IF(DorkyZáp!D18=0,\"\",DorkyZáp!D18)","v":""},{"$f":"IF(DorkyZáp!E18=0,\"\",DorkyZáp!E18)","v":""},{"$f":"IF(DorkyZáp!F18=0,\"\",DorkyZáp!F18)","v":""},{"$f":"IF(DorkyZáp!G18=0,\"\",DorkyZáp!G18)","v":""},{"$f":"IF(DorkyZáp!H18=\"\",\"\",DorkyZáp!H18)","v":""},{"$f":"IF(DorkyZáp!I18=0,\"\",DorkyZáp!I18)","v":""},{"$f":"DorkyZáp!K18","v":"nie"}]
[null,"16.",{"$f":"IF(DorkyZáp!C19=0,\"\",DorkyZáp!C19)","v":""},{"$f":"IF(DorkyZáp!D19=0,\"\",DorkyZáp!D19)","v":""},{"$f":"IF(DorkyZáp!E19=0,\"\",DorkyZáp!E19)","v":""},{"$f":"IF(DorkyZáp!F19=0,\"\",DorkyZáp!F19)","v":""},{"$f":"IF(DorkyZáp!G19=0,\"\",DorkyZáp!G19)","v":""},{"$f":"IF(DorkyZáp!H19=\"\",\"\",DorkyZáp!H19)","v":""},{"$f":"IF(DorkyZáp!I19=0,\"\",DorkyZáp!I19)","v":""},{"$f":"DorkyZáp!K19","v":"nie"}]
[null,"17.",{"$f":"IF(DorkyZáp!C20=0,\"\",DorkyZáp!C20)","v":""},{"$f":"IF(DorkyZáp!D20=0,\"\",DorkyZáp!D20)","v":""},{"$f":"IF(DorkyZáp!E20=0,\"\",DorkyZáp!E20)","v":""},{"$f":"IF(DorkyZáp!F20=0,\"\",DorkyZáp!F20)","v":""},{"$f":"IF(DorkyZáp!G20=0,\"\",DorkyZáp!G20)","v":""},{"$f":"IF(DorkyZáp!H20=\"\",\"\",DorkyZáp!H20)","v":""},{"$f":"IF(DorkyZáp!I20=0,\"\",DorkyZáp!I20)","v":""},{"$f":"DorkyZáp!K20","v":"nie"}]
[null,"18.",{"$f":"IF(DorkyZáp!C21=0,\"\",DorkyZáp!C21)","v":""},{"$f":"IF(DorkyZáp!D21=0,\"\",DorkyZáp!D21)","v":""},{"$f":"IF(DorkyZáp!E21=0,\"\",DorkyZáp!E21)","v":""},{"$f":"IF(DorkyZáp!F21=0,\"\",DorkyZáp!F21)","v":""},{"$f":"IF(DorkyZáp!G21=0,\"\",DorkyZáp!G21)","v":""},{"$f":"IF(DorkyZáp!H21=\"\",\"\",DorkyZáp!H21)","v":""},{"$f":"IF(DorkyZáp!I21=0,\"\",DorkyZáp!I21)","v":""},{"$f":"DorkyZáp!K21","v":"nie"}]
[null,"19.",{"$f":"IF(DorkyZáp!C22=0,\"\",DorkyZáp!C22)","v":""},{"$f":"IF(DorkyZáp!D22=0,\"\",DorkyZáp!D22)","v":""},{"$f":"IF(DorkyZáp!E22=0,\"\",DorkyZáp!E22)","v":""},{"$f":"IF(DorkyZáp!F22=0,\"\",DorkyZáp!F22)","v":""},{"$f":"IF(DorkyZáp!G22=0,\"\",DorkyZáp!G22)","v":""},{"$f":"IF(DorkyZáp!H22=\"\",\"\",DorkyZáp!H22)","v":""},{"$f":"IF(DorkyZáp!I22=0,\"\",DorkyZáp!I22)","v":""},{"$f":"DorkyZáp!K22","v":"nie"}]
[null,"20.",{"$f":"IF(DorkyZáp!C23=0,\"\",DorkyZáp!C23)","v":""},{"$f":"IF(DorkyZáp!D23=0,\"\",DorkyZáp!D23)","v":""},{"$f":"IF(DorkyZáp!E23=0,\"\",DorkyZáp!E23)","v":""},{"$f":"IF(DorkyZáp!F23=0,\"\",DorkyZáp!F23)","v":""},{"$f":"IF(DorkyZáp!G23=0,\"\",DorkyZáp!G23)","v":""},{"$f":"IF(DorkyZáp!H23=\"\",\"\",DorkyZáp!H23)","v":""},{"$f":"IF(DorkyZáp!I23=0,\"\",DorkyZáp!I23)","v":""},{"$f":"DorkyZáp!K23","v":"nie"}]
[null,"21.",{"$f":"IF(DorkyZáp!C24=0,\"\",DorkyZáp!C24)","v":""},{"$f":"IF(DorkyZáp!D24=0,\"\",DorkyZáp!D24)","v":""},{"$f":"IF(DorkyZáp!E24=0,\"\",DorkyZáp!E24)","v":""},{"$f":"IF(DorkyZáp!F24=0,\"\",DorkyZáp!F24)","v":""},{"$f":"IF(DorkyZáp!G24=0,\"\",DorkyZáp!G24)","v":""},{"$f":"IF(DorkyZáp!H24=\"\",\"\",DorkyZáp!H24)","v":""},{"$f":"IF(DorkyZáp!I24=0,\"\",DorkyZáp!I24)","v":""},{"$f":"DorkyZáp!K24","v":"nie"}]
[null,"22.",{"$f":"IF(DorkyZáp!C25=0,\"\",DorkyZáp!C25)","v":""},{"$f":"IF(DorkyZáp!D25=0,\"\",DorkyZáp!D25)","v":""},{"$f":"IF(DorkyZáp!E25=0,\"\",DorkyZáp!E25)","v":""},{"$f":"IF(DorkyZáp!F25=0,\"\",DorkyZáp!F25)","v":""},{"$f":"IF(DorkyZáp!G25=0,\"\",DorkyZáp!G25)","v":""},{"$f":"IF(DorkyZáp!H25=\"\",\"\",DorkyZáp!H25)","v":""},{"$f":"IF(DorkyZáp!I25=0,\"\",DorkyZáp!I25)","v":""},{"$f":"DorkyZáp!K25","v":"nie"}]
[null,"23.",{"$f":"IF(DorkyZáp!C26=0,\"\",DorkyZáp!C26)","v":""},{"$f":"IF(DorkyZáp!D26=0,\"\",DorkyZáp!D26)","v":""},{"$f":"IF(DorkyZáp!E26=0,\"\",DorkyZáp!E26)","v":""},{"$f":"IF(DorkyZáp!F26=0,\"\",DorkyZáp!F26)","v":""},{"$f":"IF(DorkyZáp!G26=0,\"\",DorkyZáp!G26)","v":""},{"$f":"IF(DorkyZáp!H26=\"\",\"\",DorkyZáp!H26)","v":""},{"$f":"IF(DorkyZáp!I26=0,\"\",DorkyZáp!I26)","v":""},{"$f":"DorkyZáp!K26","v":"nie"}]
[null,"24.",{"$f":"IF(DorkyZáp!C27=0,\"\",DorkyZáp!C27)","v":""},{"$f":"IF(DorkyZáp!D27=0,\"\",DorkyZáp!D27)","v":""},{"$f":"IF(DorkyZáp!E27=0,\"\",DorkyZáp!E27)","v":""},{"$f":"IF(DorkyZáp!F27=0,\"\",DorkyZáp!F27)","v":""},{"$f":"IF(DorkyZáp!G27=0,\"\",DorkyZáp!G27)","v":""},{"$f":"IF(DorkyZáp!H27=\"\",\"\",DorkyZáp!H27)","v":""},{"$f":"IF(DorkyZáp!I27=0,\"\",DorkyZáp!I27)","v":""},{"$f":"DorkyZáp!K27","v":"nie"}]
[null,"25.",{"$f":"IF(DorkyZáp!C28=0,\"\",DorkyZáp!C28)","v":""},{"$f":"IF(DorkyZáp!D28=0,\"\",DorkyZáp!D28)","v":""},{"$f":"IF(DorkyZáp!E28=0,\"\",DorkyZáp!E28)","v":""},{"$f":"IF(DorkyZáp!F28=0,\"\",DorkyZáp!F28)","v":""},{"$f":"IF(DorkyZáp!G28=0,\"\",DorkyZáp!G28)","v":""},{"$f":"IF(DorkyZáp!H28=\"\",\"\",DorkyZáp!H28)","v":""},{"$f":"IF(DorkyZáp!I28=0,\"\",DorkyZáp!I28)","v":""},{"$f":"DorkyZáp!K28","v":"nie"}]
[null,"26.",{"$f":"IF(DorkyZáp!C29=0,\"\",DorkyZáp!C29)","v":""},{"$f":"IF(DorkyZáp!D29=0,\"\",DorkyZáp!D29)","v":""},{"$f":"IF(DorkyZáp!E29=0,\"\",DorkyZáp!E29)","v":""},{"$f":"IF(DorkyZáp!F29=0,\"\",DorkyZáp!F29)","v":""},{"$f":"IF(DorkyZáp!G29=0,\"\",DorkyZáp!G29)","v":""},{"$f":"IF(DorkyZáp!H29=\"\",\"\",DorkyZáp!H29)","v":""},{"$f":"IF(DorkyZáp!I29=0,\"\",DorkyZáp!I29)","v":""},{"$f":"DorkyZáp!K29","v":"nie"}]
[null,"27.",{"$f":"IF(DorkyZáp!C30=0,\"\",DorkyZáp!C30)","v":""},{"$f":"IF(DorkyZáp!D30=0,\"\",DorkyZáp!D30)","v":""},{"$f":"IF(DorkyZáp!E30=0,\"\",DorkyZáp!E30)","v":""},{"$f":"IF(DorkyZáp!F30=0,\"\",DorkyZáp!F30)","v":""},{"$f":"IF(DorkyZáp!G30=0,\"\",DorkyZáp!G30)","v":""},{"$f":"IF(DorkyZáp!H30=\"\",\"\",DorkyZáp!H30)","v":""},{"$f":"IF(DorkyZáp!I30=0,\"\",DorkyZáp!I30)","v":""},{"$f":"DorkyZáp!K30","v":"nie"}]
[null,"28.",{"$f":"IF(DorkyZáp!C31=0,\"\",DorkyZáp!C31)","v":""},{"$f":"IF(DorkyZáp!D31=0,\"\",DorkyZáp!D31)","v":""},{"$f":"IF(DorkyZáp!E31=0,\"\",DorkyZáp!E31)","v":""},{"$f":"IF(DorkyZáp!F31=0,\"\",DorkyZáp!F31)","v":""},{"$f":"IF(DorkyZáp!G31=0,\"\",DorkyZáp!G31)","v":""},{"$f":"IF(DorkyZáp!H31=\"\",\"\",DorkyZáp!H31)","v":""},{"$f":"IF(DorkyZáp!I31=0,\"\",DorkyZáp!I31)","v":""},{"$f":"DorkyZáp!K31","v":"nie"}]
[null,"29.",{"$f":"IF(DorkyZáp!C32=0,\"\",DorkyZáp!C32)","v":""},{"$f":"IF(DorkyZáp!D32=0,\"\",DorkyZáp!D32)","v":""},{"$f":"IF(DorkyZáp!E32=0,\"\",DorkyZáp!E32)","v":""},{"$f":"IF(DorkyZáp!F32=0,\"\",DorkyZáp!F32)","v":""},{"$f":"IF(DorkyZáp!G32=0,\"\",DorkyZáp!G32)","v":""},{"$f":"IF(DorkyZáp!H32=\"\",\"\",DorkyZáp!H32)","v":""},{"$f":"IF(DorkyZáp!I32=0,\"\",DorkyZáp!I32)","v":""},{"$f":"DorkyZáp!K32","v":"nie"}]
[null,"30.",{"$f":"IF(DorkyZáp!C33=0,\"\",DorkyZáp!C33)","v":""},{"$f":"IF(DorkyZáp!D33=0,\"\",DorkyZáp!D33)","v":""},{"$f":"IF(DorkyZáp!E33=0,\"\",DorkyZáp!E33)","v":""},{"$f":"IF(DorkyZáp!F33=0,\"\",DorkyZáp!F33)","v":""},{"$f":"IF(DorkyZáp!G33=0,\"\",DorkyZáp!G33)","v":""},{"$f":"IF(DorkyZáp!H33=\"\",\"\",DorkyZáp!H33)","v":""},{"$f":"IF(DorkyZáp!I33=0,\"\",DorkyZáp!I33)","v":""},{"$f":"DorkyZáp!K33","v":"nie"}]
[]
[null,"Kraj :",null,{"$f":"ŽiaciZáp!$F$1","v":"Trenčiansky"},null,null,{"$f":"ŽiaciZáp!$H$2","v":"20.1.2019"}]
[null,"MK žiakov U-14 2019",null,null,"Kolkáreň :",{"$f":"ŽiaciZáp!$E$2","v":"Trenčín"}]
[]
[null,"Por.","Hráči","Č.r.p.","Klub","Plné","Dorážka","Chyby","Spolu"]
[]
[null,"1.",{"$f":"IF(ŽiaciZáp!C4=0,\"\",ŽiaciZáp!C4)","v":"Sulo Samuel"},{"$f":"IF(ŽiaciZáp!D4=0,\"\",ŽiaciZáp!D4)","v":8201},{"$f":"IF(ŽiaciZáp!E4=0,\"\",ŽiaciZáp!E4)","v":"TKKTrenčín"},{"$f":"IF(ŽiaciZáp!F4=0,\"\",ŽiaciZáp!F4)","v":147},{"$f":"IF(ŽiaciZáp!G4=0,\"\",ŽiaciZáp!G4)","v":57},{"$f":"IF(ŽiaciZáp!H4=\"\",\"\",ŽiaciZáp!H4)","v":9},{"$f":"IF(ŽiaciZáp!I4=0,\"\",ŽiaciZáp!I4)","v":204},{"$f":"ŽiaciZáp!K4","v":"áno"}]
[null,"2.",{"$f":"IF(ŽiaciZáp!C5=0,\"\",ŽiaciZáp!C5)","v":"Vandlík Tomáš"},{"$f":"IF(ŽiaciZáp!D5=0,\"\",ŽiaciZáp!D5)","v":8223},{"$f":"IF(ŽiaciZáp!E5=0,\"\",ŽiaciZáp!E5)","v":"Mkk Sraá Turá"},{"$f":"IF(ŽiaciZáp!F5=0,\"\",ŽiaciZáp!F5)","v":137},{"$f":"IF(ŽiaciZáp!G5=0,\"\",ŽiaciZáp!G5)","v":50},{"$f":"IF(ŽiaciZáp!H5=\"\",\"\",ŽiaciZáp!H5)","v":12},{"$f":"IF(ŽiaciZáp!I5=0,\"\",ŽiaciZáp!I5)","v":187},{"$f":"ŽiaciZáp!K5","v":"áno"}]
[null,"3.",{"$f":"IF(ŽiaciZáp!C6=0,\"\",ŽiaciZáp!C6)","v":"Slimák Samuel"},{"$f":"IF(ŽiaciZáp!D6=0,\"\",ŽiaciZáp!D6)","v":7782},{"$f":"IF(ŽiaciZáp!E6=0,\"\",ŽiaciZáp!E6)","v":"KK Pobedim"},{"$f":"IF(ŽiaciZáp!F6=0,\"\",ŽiaciZáp!F6)","v":153},{"$f":"IF(ŽiaciZáp!G6=0,\"\",ŽiaciZáp!G6)","v":30},{"$f":"IF(ŽiaciZáp!H6=\"\",\"\",ŽiaciZáp!H6)","v":16},{"$f":"IF(ŽiaciZáp!I6=0,\"\",ŽiaciZáp!I6)","v":183},{"$f":"ŽiaciZáp!K6","v":"áno"}]
[null,"4.",{"$f":"IF(ŽiaciZáp!C7=0,\"\",ŽiaciZáp!C7)","v":"Dúdik Samuel"},{"$f":"IF(ŽiaciZáp!D7=0,\"\",ŽiaciZáp!D7)","v":1214},{"$f":"IF(ŽiaciZáp!E7=0,\"\",ŽiaciZáp!E7)","v":"KK Pobedim"},{"$f":"IF(ŽiaciZáp!F7=0,\"\",ŽiaciZáp!F7)","v":167},{"$f":"IF(ŽiaciZáp!G7=0,\"\",ŽiaciZáp!G7)","v":84},{"$f":"IF(ŽiaciZáp!H7=\"\",\"\",ŽiaciZáp!H7)","v":3},{"$f":"IF(ŽiaciZáp!I7=0,\"\",ŽiaciZáp!I7)","v":251},{"$f":"ŽiaciZáp!K7","v":"áno"}]
[null,"5.",{"$f":"IF(ŽiaciZáp!C8=0,\"\",ŽiaciZáp!C8)","v":"Pečenkár Ondrej"},{"$f":"IF(ŽiaciZáp!D8=0,\"\",ŽiaciZáp!D8)","v":1235},{"$f":"IF(ŽiaciZáp!E8=0,\"\",ŽiaciZáp!E8)","v":"KK Pobedim"},{"$f":"IF(ŽiaciZáp!F8=0,\"\",ŽiaciZáp!F8)","v":155},{"$f":"IF(ŽiaciZáp!G8=0,\"\",ŽiaciZáp!G8)","v":70},{"$f":"IF(ŽiaciZáp!H8=\"\",\"\",ŽiaciZáp!H8)","v":11},{"$f":"IF(ŽiaciZáp!I8=0,\"\",ŽiaciZáp!I8)","v":225},{"$f":"ŽiaciZáp!K8","v":"áno"}]
[null,"6.",{"$f":"IF(ŽiaciZáp!C9=0,\"\",ŽiaciZáp!C9)","v":""},{"$f":"IF(ŽiaciZáp!D9=0,\"\",ŽiaciZáp!D9)","v":""},{"$f":"IF(ŽiaciZáp!E9=0,\"\",ŽiaciZáp!E9)","v":""},{"$f":"IF(ŽiaciZáp!F9=0,\"\",ŽiaciZáp!F9)","v":""},{"$f":"IF(ŽiaciZáp!G9=0,\"\",ŽiaciZáp!G9)","v":""},{"$f":"IF(ŽiaciZáp!H9=\"\",\"\",ŽiaciZáp!H9)","v":""},{"$f":"IF(ŽiaciZáp!I9=0,\"\",ŽiaciZáp!I9)","v":""},{"$f":"ŽiaciZáp!K9","v":"nie"}]
[null,"7.",{"$f":"IF(ŽiaciZáp!C10=0,\"\",ŽiaciZáp!C10)","v":""},{"$f":"IF(ŽiaciZáp!D10=0,\"\",ŽiaciZáp!D10)","v":""},{"$f":"IF(ŽiaciZáp!E10=0,\"\",ŽiaciZáp!E10)","v":""},{"$f":"IF(ŽiaciZáp!F10=0,\"\",ŽiaciZáp!F10)","v":""},{"$f":"IF(ŽiaciZáp!G10=0,\"\",ŽiaciZáp!G10)","v":""},{"$f":"IF(ŽiaciZáp!H10=\"\",\"\",ŽiaciZáp!H10)","v":""},{"$f":"IF(ŽiaciZáp!I10=0,\"\",ŽiaciZáp!I10)","v":""},{"$f":"ŽiaciZáp!K10","v":"nie"}]
[null,"8.",{"$f":"IF(ŽiaciZáp!C11=0,\"\",ŽiaciZáp!C11)","v":""},{"$f":"IF(ŽiaciZáp!D11=0,\"\",ŽiaciZáp!D11)","v":""},{"$f":"IF(ŽiaciZáp!E11=0,\"\",ŽiaciZáp!E11)","v":""},{"$f":"IF(ŽiaciZáp!F11=0,\"\",ŽiaciZáp!F11)","v":""},{"$f":"IF(ŽiaciZáp!G11=0,\"\",ŽiaciZáp!G11)","v":""},{"$f":"IF(ŽiaciZáp!H11=\"\",\"\",ŽiaciZáp!H11)","v":""},{"$f":"IF(ŽiaciZáp!I11=0,\"\",ŽiaciZáp!I11)","v":""},{"$f":"ŽiaciZáp!K11","v":"nie"}]
[null,"9.",{"$f":"IF(ŽiaciZáp!C12=0,\"\",ŽiaciZáp!C12)","v":""},{"$f":"IF(ŽiaciZáp!D12=0,\"\",ŽiaciZáp!D12)","v":""},{"$f":"IF(ŽiaciZáp!E12=0,\"\",ŽiaciZáp!E12)","v":""},{"$f":"IF(ŽiaciZáp!F12=0,\"\",ŽiaciZáp!F12)","v":""},{"$f":"IF(ŽiaciZáp!G12=0,\"\",ŽiaciZáp!G12)","v":""},{"$f":"IF(ŽiaciZáp!H12=\"\",\"\",ŽiaciZáp!H12)","v":""},{"$f":"IF(ŽiaciZáp!I12=0,\"\",ŽiaciZáp!I12)","v":""},{"$f":"ŽiaciZáp!K12","v":"nie"}]
[null,"10.",{"$f":"IF(ŽiaciZáp!C13=0,\"\",ŽiaciZáp!C13)","v":""},{"$f":"IF(ŽiaciZáp!D13=0,\"\",ŽiaciZáp!D13)","v":""},{"$f":"IF(ŽiaciZáp!E13=0,\"\",ŽiaciZáp!E13)","v":""},{"$f":"IF(ŽiaciZáp!F13=0,\"\",ŽiaciZáp!F13)","v":""},{"$f":"IF(ŽiaciZáp!G13=0,\"\",ŽiaciZáp!G13)","v":""},{"$f":"IF(ŽiaciZáp!H13=\"\",\"\",ŽiaciZáp!H13)","v":""},{"$f":"IF(ŽiaciZáp!I13=0,\"\",ŽiaciZáp!I13)","v":""},{"$f":"ŽiaciZáp!K13","v":"nie"}]
[null,"11.",{"$f":"IF(ŽiaciZáp!C14=0,\"\",ŽiaciZáp!C14)","v":""},{"$f":"IF(ŽiaciZáp!D14=0,\"\",ŽiaciZáp!D14)","v":""},{"$f":"IF(ŽiaciZáp!E14=0,\"\",ŽiaciZáp!E14)","v":""},{"$f":"IF(ŽiaciZáp!F14=0,\"\",ŽiaciZáp!F14)","v":""},{"$f":"IF(ŽiaciZáp!G14=0,\"\",ŽiaciZáp!G14)","v":""},{"$f":"IF(ŽiaciZáp!H14=\"\",\"\",ŽiaciZáp!H14)","v":""},{"$f":"IF(ŽiaciZáp!I14=0,\"\",ŽiaciZáp!I14)","v":""},{"$f":"ŽiaciZáp!K14","v":"nie"}]
[null,"12.",{"$f":"IF(ŽiaciZáp!C15=0,\"\",ŽiaciZáp!C15)","v":""},{"$f":"IF(ŽiaciZáp!D15=0,\"\",ŽiaciZáp!D15)","v":""},{"$f":"IF(ŽiaciZáp!E15=0,\"\",ŽiaciZáp!E15)","v":""},{"$f":"IF(ŽiaciZáp!F15=0,\"\",ŽiaciZáp!F15)","v":""},{"$f":"IF(ŽiaciZáp!G15=0,\"\",ŽiaciZáp!G15)","v":""},{"$f":"IF(ŽiaciZáp!H15=\"\",\"\",ŽiaciZáp!H15)","v":""},{"$f":"IF(ŽiaciZáp!I15=0,\"\",ŽiaciZáp!I15)","v":""},{"$f":"ŽiaciZáp!K15","v":"nie"}]
[null,"13.",{"$f":"IF(ŽiaciZáp!C16=0,\"\",ŽiaciZáp!C16)","v":""},{"$f":"IF(ŽiaciZáp!D16=0,\"\",ŽiaciZáp!D16)","v":""},{"$f":"IF(ŽiaciZáp!E16=0,\"\",ŽiaciZáp!E16)","v":""},{"$f":"IF(ŽiaciZáp!F16=0,\"\",ŽiaciZáp!F16)","v":""},{"$f":"IF(ŽiaciZáp!G16=0,\"\",ŽiaciZáp!G16)","v":""},{"$f":"IF(ŽiaciZáp!H16=\"\",\"\",ŽiaciZáp!H16)","v":""},{"$f":"IF(ŽiaciZáp!I16=0,\"\",ŽiaciZáp!I16)","v":""},{"$f":"ŽiaciZáp!K16","v":"nie"}]
[null,"14.",{"$f":"IF(ŽiaciZáp!C17=0,\"\",ŽiaciZáp!C17)","v":""},{"$f":"IF(ŽiaciZáp!D17=0,\"\",ŽiaciZáp!D17)","v":""},{"$f":"IF(ŽiaciZáp!E17=0,\"\",ŽiaciZáp!E17)","v":""},{"$f":"IF(ŽiaciZáp!F17=0,\"\",ŽiaciZáp!F17)","v":""},{"$f":"IF(ŽiaciZáp!G17=0,\"\",ŽiaciZáp!G17)","v":""},{"$f":"IF(ŽiaciZáp!H17=\"\",\"\",ŽiaciZáp!H17)","v":""},{"$f":"IF(ŽiaciZáp!I17=0,\"\",ŽiaciZáp!I17)","v":""},{"$f":"ŽiaciZáp!K17","v":"nie"}]
[null,"15.",{"$f":"IF(ŽiaciZáp!C18=0,\"\",ŽiaciZáp!C18)","v":""},{"$f":"IF(ŽiaciZáp!D18=0,\"\",ŽiaciZáp!D18)","v":""},{"$f":"IF(ŽiaciZáp!E18=0,\"\",ŽiaciZáp!E18)","v":""},{"$f":"IF(ŽiaciZáp!F18=0,\"\",ŽiaciZáp!F18)","v":""},{"$f":"IF(ŽiaciZáp!G18=0,\"\",ŽiaciZáp!G18)","v":""},{"$f":"IF(ŽiaciZáp!H18=\"\",\"\",ŽiaciZáp!H18)","v":""},{"$f":"IF(ŽiaciZáp!I18=0,\"\",ŽiaciZáp!I18)","v":""},{"$f":"ŽiaciZáp!K18","v":"nie"}]
[null,"16.",{"$f":"IF(ŽiaciZáp!C19=0,\"\",ŽiaciZáp!C19)","v":""},{"$f":"IF(ŽiaciZáp!D19=0,\"\",ŽiaciZáp!D19)","v":""},{"$f":"IF(ŽiaciZáp!E19=0,\"\",ŽiaciZáp!E19)","v":""},{"$f":"IF(ŽiaciZáp!F19=0,\"\",ŽiaciZáp!F19)","v":""},{"$f":"IF(ŽiaciZáp!G19=0,\"\",ŽiaciZáp!G19)","v":""},{"$f":"IF(ŽiaciZáp!H19=\"\",\"\",ŽiaciZáp!H19)","v":""},{"$f":"IF(ŽiaciZáp!I19=0,\"\",ŽiaciZáp!I19)","v":""},{"$f":"ŽiaciZáp!K19","v":"nie"}]
[null,"17.",{"$f":"IF(ŽiaciZáp!C20=0,\"\",ŽiaciZáp!C20)","v":""},{"$f":"IF(ŽiaciZáp!D20=0,\"\",ŽiaciZáp!D20)","v":""},{"$f":"IF(ŽiaciZáp!E20=0,\"\",ŽiaciZáp!E20)","v":""},{"$f":"IF(ŽiaciZáp!F20=0,\"\",ŽiaciZáp!F20)","v":""},{"$f":"IF(ŽiaciZáp!G20=0,\"\",ŽiaciZáp!G20)","v":""},{"$f":"IF(ŽiaciZáp!H20=\"\",\"\",ŽiaciZáp!H20)","v":""},{"$f":"IF(ŽiaciZáp!I20=0,\"\",ŽiaciZáp!I20)","v":""},{"$f":"ŽiaciZáp!K20","v":"nie"}]
[null,"18.",{"$f":"IF(ŽiaciZáp!C21=0,\"\",ŽiaciZáp!C21)","v":""},{"$f":"IF(ŽiaciZáp!D21=0,\"\",ŽiaciZáp!D21)","v":""},{"$f":"IF(ŽiaciZáp!E21=0,\"\",ŽiaciZáp!E21)","v":""},{"$f":"IF(ŽiaciZáp!F21=0,\"\",ŽiaciZáp!F21)","v":""},{"$f":"IF(ŽiaciZáp!G21=0,\"\",ŽiaciZáp!G21)","v":""},{"$f":"IF(ŽiaciZáp!H21=\"\",\"\",ŽiaciZáp!H21)","v":""},{"$f":"IF(ŽiaciZáp!I21=0,\"\",ŽiaciZáp!I21)","v":""},{"$f":"ŽiaciZáp!K21","v":"nie"}]
[null,"19.",{"$f":"IF(ŽiaciZáp!C22=0,\"\",ŽiaciZáp!C22)","v":""},{"$f":"IF(ŽiaciZáp!D22=0,\"\",ŽiaciZáp!D22)","v":""},{"$f":"IF(ŽiaciZáp!E22=0,\"\",ŽiaciZáp!E22)","v":""},{"$f":"IF(ŽiaciZáp!F22=0,\"\",ŽiaciZáp!F22)","v":""},{"$f":"IF(ŽiaciZáp!G22=0,\"\",ŽiaciZáp!G22)","v":""},{"$f":"IF(ŽiaciZáp!H22=\"\",\"\",ŽiaciZáp!H22)","v":""},{"$f":"IF(ŽiaciZáp!I22=0,\"\",ŽiaciZáp!I22)","v":""},{"$f":"ŽiaciZáp!K22","v":"nie"}]
[null,"20.",{"$f":"IF(ŽiaciZáp!C23=0,\"\",ŽiaciZáp!C23)","v":""},{"$f":"IF(ŽiaciZáp!D23=0,\"\",ŽiaciZáp!D23)","v":""},{"$f":"IF(ŽiaciZáp!E23=0,\"\",ŽiaciZáp!E23)","v":""},{"$f":"IF(ŽiaciZáp!F23=0,\"\",ŽiaciZáp!F23)","v":""},{"$f":"IF(ŽiaciZáp!G23=0,\"\",ŽiaciZáp!G23)","v":""},{"$f":"IF(ŽiaciZáp!H23=\"\",\"\",ŽiaciZáp!H23)","v":""},{"$f":"IF(ŽiaciZáp!I23=0,\"\",ŽiaciZáp!I23)","v":""},{"$f":"ŽiaciZáp!K23","v":"nie"}]
[null,"21.",{"$f":"IF(ŽiaciZáp!C24=0,\"\",ŽiaciZáp!C24)","v":""},{"$f":"IF(ŽiaciZáp!D24=0,\"\",ŽiaciZáp!D24)","v":""},{"$f":"IF(ŽiaciZáp!E24=0,\"\",ŽiaciZáp!E24)","v":""},{"$f":"IF(ŽiaciZáp!F24=0,\"\",ŽiaciZáp!F24)","v":""},{"$f":"IF(ŽiaciZáp!G24=0,\"\",ŽiaciZáp!G24)","v":""},{"$f":"IF(ŽiaciZáp!H24=\"\",\"\",ŽiaciZáp!H24)","v":""},{"$f":"IF(ŽiaciZáp!I24=0,\"\",ŽiaciZáp!I24)","v":""},{"$f":"ŽiaciZáp!K24","v":"nie"}]
[null,"22.",{"$f":"IF(ŽiaciZáp!C25=0,\"\",ŽiaciZáp!C25)","v":""},{"$f":"IF(ŽiaciZáp!D25=0,\"\",ŽiaciZáp!D25)","v":""},{"$f":"IF(ŽiaciZáp!E25=0,\"\",ŽiaciZáp!E25)","v":""},{"$f":"IF(ŽiaciZáp!F25=0,\"\",ŽiaciZáp!F25)","v":""},{"$f":"IF(ŽiaciZáp!G25=0,\"\",ŽiaciZáp!G25)","v":""},{"$f":"IF(ŽiaciZáp!H25=\"\",\"\",ŽiaciZáp!H25)","v":""},{"$f":"IF(ŽiaciZáp!I25=0,\"\",ŽiaciZáp!I25)","v":""},{"$f":"ŽiaciZáp!K25","v":"nie"}]
[null,"23.",{"$f":"IF(ŽiaciZáp!C26=0,\"\",ŽiaciZáp!C26)","v":""},{"$f":"IF(ŽiaciZáp!D26=0,\"\",ŽiaciZáp!D26)","v":""},{"$f":"IF(ŽiaciZáp!E26=0,\"\",ŽiaciZáp!E26)","v":""},{"$f":"IF(ŽiaciZáp!F26=0,\"\",ŽiaciZáp!F26)","v":""},{"$f":"IF(ŽiaciZáp!G26=0,\"\",ŽiaciZáp!G26)","v":""},{"$f":"IF(ŽiaciZáp!H26=\"\",\"\",ŽiaciZáp!H26)","v":""},{"$f":"IF(ŽiaciZáp!I26=0,\"\",ŽiaciZáp!I26)","v":""},{"$f":"ŽiaciZáp!K26","v":"nie"}]
[null,"24.",{"$f":"IF(ŽiaciZáp!C27=0,\"\",ŽiaciZáp!C27)","v":""},{"$f":"IF(ŽiaciZáp!D27=0,\"\",ŽiaciZáp!D27)","v":""},{"$f":"IF(ŽiaciZáp!E27=0,\"\",ŽiaciZáp!E27)","v":""},{"$f":"IF(ŽiaciZáp!F27=0,\"\",ŽiaciZáp!F27)","v":""},{"$f":"IF(ŽiaciZáp!G27=0,\"\",ŽiaciZáp!G27)","v":""},{"$f":"IF(ŽiaciZáp!H27=\"\",\"\",ŽiaciZáp!H27)","v":""},{"$f":"IF(ŽiaciZáp!I27=0,\"\",ŽiaciZáp!I27)","v":""},{"$f":"ŽiaciZáp!K27","v":"nie"}]
[null,"25.",{"$f":"IF(ŽiaciZáp!C28=0,\"\",ŽiaciZáp!C28)","v":""},{"$f":"IF(ŽiaciZáp!D28=0,\"\",ŽiaciZáp!D28)","v":""},{"$f":"IF(ŽiaciZáp!E28=0,\"\",ŽiaciZáp!E28)","v":""},{"$f":"IF(ŽiaciZáp!F28=0,\"\",ŽiaciZáp!F28)","v":""},{"$f":"IF(ŽiaciZáp!G28=0,\"\",ŽiaciZáp!G28)","v":""},{"$f":"IF(ŽiaciZáp!H28=\"\",\"\",ŽiaciZáp!H28)","v":""},{"$f":"IF(ŽiaciZáp!I28=0,\"\",ŽiaciZáp!I28)","v":""},{"$f":"ŽiaciZáp!K28","v":"nie"}]
[null,"26.",{"$f":"IF(ŽiaciZáp!C29=0,\"\",ŽiaciZáp!C29)","v":""},{"$f":"IF(ŽiaciZáp!D29=0,\"\",ŽiaciZáp!D29)","v":""},{"$f":"IF(ŽiaciZáp!E29=0,\"\",ŽiaciZáp!E29)","v":""},{"$f":"IF(ŽiaciZáp!F29=0,\"\",ŽiaciZáp!F29)","v":""},{"$f":"IF(ŽiaciZáp!G29=0,\"\",ŽiaciZáp!G29)","v":""},{"$f":"IF(ŽiaciZáp!H29=\"\",\"\",ŽiaciZáp!H29)","v":""},{"$f":"IF(ŽiaciZáp!I29=0,\"\",ŽiaciZáp!I29)","v":""},{"$f":"ŽiaciZáp!K29","v":"nie"}]
[null,"27.",{"$f":"IF(ŽiaciZáp!C30=0,\"\",ŽiaciZáp!C30)","v":""},{"$f":"IF(ŽiaciZáp!D30=0,\"\",ŽiaciZáp!D30)","v":""},{"$f":"IF(ŽiaciZáp!E30=0,\"\",ŽiaciZáp!E30)","v":""},{"$f":"IF(ŽiaciZáp!F30=0,\"\",ŽiaciZáp!F30)","v":""},{"$f":"IF(ŽiaciZáp!G30=0,\"\",ŽiaciZáp!G30)","v":""},{"$f":"IF(ŽiaciZáp!H30=\"\",\"\",ŽiaciZáp!H30)","v":""},{"$f":"IF(ŽiaciZáp!I30=0,\"\",ŽiaciZáp!I30)","v":""},{"$f":"ŽiaciZáp!K30","v":"nie"}]
[null,"28.",{"$f":"IF(ŽiaciZáp!C31=0,\"\",ŽiaciZáp!C31)","v":""},{"$f":"IF(ŽiaciZáp!D31=0,\"\",ŽiaciZáp!D31)","v":""},{"$f":"IF(ŽiaciZáp!E31=0,\"\",ŽiaciZáp!E31)","v":""},{"$f":"IF(ŽiaciZáp!F31=0,\"\",ŽiaciZáp!F31)","v":""},{"$f":"IF(ŽiaciZáp!G31=0,\"\",ŽiaciZáp!G31)","v":""},{"$f":"IF(ŽiaciZáp!H31=\"\",\"\",ŽiaciZáp!H31)","v":""},{"$f":"IF(ŽiaciZáp!I31=0,\"\",ŽiaciZáp!I31)","v":""},{"$f":"ŽiaciZáp!K31","v":"nie"}]
[null,"29.",{"$f":"IF(ŽiaciZáp!C32=0,\"\",ŽiaciZáp!C32)","v":""},{"$f":"IF(ŽiaciZáp!D32=0,\"\",ŽiaciZáp!D32)","v":""},{"$f":"IF(ŽiaciZáp!E32=0,\"\",ŽiaciZáp!E32)","v":""},{"$f":"IF(ŽiaciZáp!F32=0,\"\",ŽiaciZáp!F32)","v":""},{"$f":"IF(ŽiaciZáp!G32=0,\"\",ŽiaciZáp!G32)","v":""},{"$f":"IF(ŽiaciZáp!H32=\"\",\"\",ŽiaciZáp!H32)","v":""},{"$f":"IF(ŽiaciZáp!I32=0,\"\",ŽiaciZáp!I32)","v":""},{"$f":"ŽiaciZáp!K32","v":"nie"}]
[null,"30.",{"$f":"IF(ŽiaciZáp!C33=0,\"\",ŽiaciZáp!C33)","v":""},{"$f":"IF(ŽiaciZáp!D33=0,\"\",ŽiaciZáp!D33)","v":""},{"$f":"IF(ŽiaciZáp!E33=0,\"\",ŽiaciZáp!E33)","v":""},{"$f":"IF(ŽiaciZáp!F33=0,\"\",ŽiaciZáp!F33)","v":""},{"$f":"IF(ŽiaciZáp!G33=0,\"\",ŽiaciZáp!G33)","v":""},{"$f":"IF(ŽiaciZáp!H33=\"\",\"\",ŽiaciZáp!H33)","v":""},{"$f":"IF(ŽiaciZáp!I33=0,\"\",ŽiaciZáp!I33)","v":""},{"$f":"ŽiaciZáp!K33","v":"nie"}]
[null,"31.",{"$f":"IF(ŽiaciZáp!C34=0,\"\",ŽiaciZáp!C34)","v":""},{"$f":"IF(ŽiaciZáp!D34=0,\"\",ŽiaciZáp!D34)","v":""},{"$f":"IF(ŽiaciZáp!E34=0,\"\",ŽiaciZáp!E34)","v":""},{"$f":"IF(ŽiaciZáp!F34=0,\"\",ŽiaciZáp!F34)","v":""},{"$f":"IF(ŽiaciZáp!G34=0,\"\",ŽiaciZáp!G34)","v":""},{"$f":"IF(ŽiaciZáp!H34=\"\",\"\",ŽiaciZáp!H34)","v":""},{"$f":"IF(ŽiaciZáp!I34=0,\"\",ŽiaciZáp!I34)","v":""},{"$f":"ŽiaciZáp!K34","v":"nie"}]
[null,"32.",{"$f":"IF(ŽiaciZáp!C35=0,\"\",ŽiaciZáp!C35)","v":""},{"$f":"IF(ŽiaciZáp!D35=0,\"\",ŽiaciZáp!D35)","v":""},{"$f":"IF(ŽiaciZáp!E35=0,\"\",ŽiaciZáp!E35)","v":""},{"$f":"IF(ŽiaciZáp!F35=0,\"\",ŽiaciZáp!F35)","v":""},{"$f":"IF(ŽiaciZáp!G35=0,\"\",ŽiaciZáp!G35)","v":""},{"$f":"IF(ŽiaciZáp!H35=\"\",\"\",ŽiaciZáp!H35)","v":""},{"$f":"IF(ŽiaciZáp!I35=0,\"\",ŽiaciZáp!I35)","v":""},{"$f":"ŽiaciZáp!K35","v":"nie"}]
[null,"33.",{"$f":"IF(ŽiaciZáp!C36=0,\"\",ŽiaciZáp!C36)","v":""},{"$f":"IF(ŽiaciZáp!D36=0,\"\",ŽiaciZáp!D36)","v":""},{"$f":"IF(ŽiaciZáp!E36=0,\"\",ŽiaciZáp!E36)","v":""},{"$f":"IF(ŽiaciZáp!F36=0,\"\",ŽiaciZáp!F36)","v":""},{"$f":"IF(ŽiaciZáp!G36=0,\"\",ŽiaciZáp!G36)","v":""},{"$f":"IF(ŽiaciZáp!H36=\"\",\"\",ŽiaciZáp!H36)","v":""},{"$f":"IF(ŽiaciZáp!I36=0,\"\",ŽiaciZáp!I36)","v":""},{"$f":"ŽiaciZáp!K36","v":"nie"}]
[null,"34.",{"$f":"IF(ŽiaciZáp!C37=0,\"\",ŽiaciZáp!C37)","v":""},{"$f":"IF(ŽiaciZáp!D37=0,\"\",ŽiaciZáp!D37)","v":""},{"$f":"IF(ŽiaciZáp!E37=0,\"\",ŽiaciZáp!E37)","v":""},{"$f":"IF(ŽiaciZáp!F37=0,\"\",ŽiaciZáp!F37)","v":""},{"$f":"IF(ŽiaciZáp!G37=0,\"\",ŽiaciZáp!G37)","v":""},{"$f":"IF(ŽiaciZáp!H37=\"\",\"\",ŽiaciZáp!H37)","v":""},{"$f":"IF(ŽiaciZáp!I37=0,\"\",ŽiaciZáp!I37)","v":""},{"$f":"ŽiaciZáp!K37","v":"nie"}]
[null,"35.",{"$f":"IF(ŽiaciZáp!C38=0,\"\",ŽiaciZáp!C38)","v":""},{"$f":"IF(ŽiaciZáp!D38=0,\"\",ŽiaciZáp!D38)","v":""},{"$f":"IF(ŽiaciZáp!E38=0,\"\",ŽiaciZáp!E38)","v":""},{"$f":"IF(ŽiaciZáp!F38=0,\"\",ŽiaciZáp!F38)","v":""},{"$f":"IF(ŽiaciZáp!G38=0,\"\",ŽiaciZáp!G38)","v":""},{"$f":"IF(ŽiaciZáp!H38=\"\",\"\",ŽiaciZáp!H38)","v":""},{"$f":"IF(ŽiaciZáp!I38=0,\"\",ŽiaciZáp!I38)","v":""},{"$f":"ŽiaciZáp!K38","v":"nie"}]
[null,"36.",{"$f":"IF(ŽiaciZáp!C39=0,\"\",ŽiaciZáp!C39)","v":""},{"$f":"IF(ŽiaciZáp!D39=0,\"\",ŽiaciZáp!D39)","v":""},{"$f":"IF(ŽiaciZáp!E39=0,\"\",ŽiaciZáp!E39)","v":""},{"$f":"IF(ŽiaciZáp!F39=0,\"\",ŽiaciZáp!F39)","v":""},{"$f":"IF(ŽiaciZáp!G39=0,\"\",ŽiaciZáp!G39)","v":""},{"$f":"IF(ŽiaciZáp!H39=\"\",\"\",ŽiaciZáp!H39)","v":""},{"$f":"IF(ŽiaciZáp!I39=0,\"\",ŽiaciZáp!I39)","v":""},{"$f":"ŽiaciZáp!K39","v":"nie"}]
[null,"37.",{"$f":"IF(ŽiaciZáp!C40=0,\"\",ŽiaciZáp!C40)","v":""},{"$f":"IF(ŽiaciZáp!D40=0,\"\",ŽiaciZáp!D40)","v":""},{"$f":"IF(ŽiaciZáp!E40=0,\"\",ŽiaciZáp!E40)","v":""},{"$f":"IF(ŽiaciZáp!F40=0,\"\",ŽiaciZáp!F40)","v":""},{"$f":"IF(ŽiaciZáp!G40=0,\"\",ŽiaciZáp!G40)","v":""},{"$f":"IF(ŽiaciZáp!H40=\"\",\"\",ŽiaciZáp!H40)","v":""},{"$f":"IF(ŽiaciZáp!I40=0,\"\",ŽiaciZáp!I40)","v":""},{"$f":"ŽiaciZáp!K40","v":"nie"}]
[null,"38.",{"$f":"IF(ŽiaciZáp!C41=0,\"\",ŽiaciZáp!C41)","v":""},{"$f":"IF(ŽiaciZáp!D41=0,\"\",ŽiaciZáp!D41)","v":""},{"$f":"IF(ŽiaciZáp!E41=0,\"\",ŽiaciZáp!E41)","v":""},{"$f":"IF(ŽiaciZáp!F41=0,\"\",ŽiaciZáp!F41)","v":""},{"$f":"IF(ŽiaciZáp!G41=0,\"\",ŽiaciZáp!G41)","v":""},{"$f":"IF(ŽiaciZáp!H41=\"\",\"\",ŽiaciZáp!H41)","v":""},{"$f":"IF(ŽiaciZáp!I41=0,\"\",ŽiaciZáp!I41)","v":""},{"$f":"ŽiaciZáp!K41","v":"nie"}]
[null,"39.",{"$f":"IF(ŽiaciZáp!C42=0,\"\",ŽiaciZáp!C42)","v":""},{"$f":"IF(ŽiaciZáp!D42=0,\"\",ŽiaciZáp!D42)","v":""},{"$f":"IF(ŽiaciZáp!E42=0,\"\",ŽiaciZáp!E42)","v":""},{"$f":"IF(ŽiaciZáp!F42=0,\"\",ŽiaciZáp!F42)","v":""},{"$f":"IF(ŽiaciZáp!G42=0,\"\",ŽiaciZáp!G42)","v":""},{"$f":"IF(ŽiaciZáp!H42=\"\",\"\",ŽiaciZáp!H42)","v":""},{"$f":"IF(ŽiaciZáp!I42=0,\"\",ŽiaciZáp!I42)","v":""},{"$f":"ŽiaciZáp!K42","v":"nie"}]
[null,"40.",{"$f":"IF(ŽiaciZáp!C43=0,\"\",ŽiaciZáp!C43)","v":""},{"$f":"IF(ŽiaciZáp!D43=0,\"\",ŽiaciZáp!D43)","v":""},{"$f":"IF(ŽiaciZáp!E43=0,\"\",ŽiaciZáp!E43)","v":""},{"$f":"IF(ŽiaciZáp!F43=0,\"\",ŽiaciZáp!F43)","v":""},{"$f":"IF(ŽiaciZáp!G43=0,\"\",ŽiaciZáp!G43)","v":""},{"$f":"IF(ŽiaciZáp!H43=\"\",\"\",ŽiaciZáp!H43)","v":""},{"$f":"IF(ŽiaciZáp!I43=0,\"\",ŽiaciZáp!I43)","v":""},{"$f":"ŽiaciZáp!K43","v":"nie"}]
[]
[null,"Kraj :",null,{"$f":"ŽiačkykyZáp!$F$1","v":"Trenčiansky"},null,null,{"$f":"ŽiačkykyZáp!$H$2","v":"20.1.2019"}]
[null,"MK žiačok U-14 2019",null,null,"Kolkáreň :",{"$f":"ŽiačkykyZáp!$E$2","v":"Trenčín"}]
[]
[null,"Por.","Hráči","Č.r.p.","Klub","Plné","Dorážka","Chyby","Spolu"]
[]
[null,"1.",{"$f":"IF(ŽiačkykyZáp!C4=0,\"\",ŽiačkykyZáp!C4)","v":"Mazániková Ema"},{"$f":"IF(ŽiačkykyZáp!D4=0,\"\",ŽiačkykyZáp!D4)","v":8196},{"$f":"IF(ŽiačkykyZáp!E4=0,\"\",ŽiačkykyZáp!E4)","v":"TKK Trenčín"},{"$f":"IF(ŽiačkykyZáp!F4=0,\"\",ŽiačkykyZáp!F4)","v":151},{"$f":"IF(ŽiačkykyZáp!G4=0,\"\",ŽiačkykyZáp!G4)","v":65},{"$f":"IF(ŽiačkykyZáp!H4=\"\",\"\",ŽiačkykyZáp!H4)","v":5},{"$f":"IF(ŽiačkykyZáp!I4=0,\"\",ŽiačkykyZáp!I4)","v":216},{"$f":"ŽiačkykyZáp!K4","v":"áno"}]
[null,"2.",{"$f":"IF(ŽiačkykyZáp!C5=0,\"\",ŽiačkykyZáp!C5)","v":"Jurčíková Alžbeta"},{"$f":"IF(ŽiačkykyZáp!D5=0,\"\",ŽiačkykyZáp!D5)","v":8199},{"$f":"IF(ŽiačkykyZáp!E5=0,\"\",ŽiačkykyZáp!E5)","v":"TKK Trenčín"},{"$f":"IF(ŽiačkykyZáp!F5=0,\"\",ŽiačkykyZáp!F5)","v":125},{"$f":"IF(ŽiačkykyZáp!G5=0,\"\",ŽiačkykyZáp!G5)","v":39},{"$f":"IF(ŽiačkykyZáp!H5=\"\",\"\",ŽiačkykyZáp!H5)","v":22},{"$f":"IF(ŽiačkykyZáp!I5=0,\"\",ŽiačkykyZáp!I5)","v":164},{"$f":"ŽiačkykyZáp!K5","v":"áno"}]
[null,"3.",{"$f":"IF(ŽiačkykyZáp!C6=0,\"\",ŽiačkykyZáp!C6)","v":"Malíčková Radoslava"},{"$f":"IF(ŽiačkykyZáp!D6=0,\"\",ŽiačkykyZáp!D6)","v":1238},{"$f":"IF(ŽiačkykyZáp!E6=0,\"\",ŽiačkykyZáp!E6)","v":"KK Pobedim"},{"$f":"IF(ŽiačkykyZáp!F6=0,\"\",ŽiačkykyZáp!F6)","v":163},{"$f":"IF(ŽiačkykyZáp!G6=0,\"\",ŽiačkykyZáp!G6)","v":68},{"$f":"IF(ŽiačkykyZáp!H6=\"\",\"\",ŽiačkykyZáp!H6)","v":10},{"$f":"IF(ŽiačkykyZáp!I6=0,\"\",ŽiačkykyZáp!I6)","v":231},{"$f":"ŽiačkykyZáp!K6","v":"áno"}]
[null,"4.",{"$f":"IF(ŽiačkykyZáp!C7=0,\"\",ŽiačkykyZáp!C7)","v":"Danková Sarah"},{"$f":"IF(ŽiačkykyZáp!D7=0,\"\",ŽiačkykyZáp!D7)","v":8222},{"$f":"IF(ŽiačkykyZáp!E7=0,\"\",ŽiačkykyZáp!E7)","v":"MKK Stará Turá"},{"$f":"IF(ŽiačkykyZáp!F7=0,\"\",ŽiačkykyZáp!F7)","v":147},{"$f":"IF(ŽiačkykyZáp!G7=0,\"\",ŽiačkykyZáp!G7)","v":55},{"$f":"IF(ŽiačkykyZáp!H7=\"\",\"\",ŽiačkykyZáp!H7)","v":9},{"$f":"IF(ŽiačkykyZáp!I7=0,\"\",ŽiačkykyZáp!I7)","v":202},{"$f":"ŽiačkykyZáp!K7","v":"áno"}]
[null,"5.",{"$f":"IF(ŽiačkykyZáp!C8=0,\"\",ŽiačkykyZáp!C8)","v":"Koreňová Petra"},{"$f":"IF(ŽiačkykyZáp!D8=0,\"\",ŽiačkykyZáp!D8)","v":1117},{"$f":"IF(ŽiačkykyZáp!E8=0,\"\",ŽiačkykyZáp!E8)","v":"TKK Trenčín"},{"$f":"IF(ŽiačkykyZáp!F8=0,\"\",ŽiačkykyZáp!F8)","v":149},{"$f":"IF(ŽiačkykyZáp!G8=0,\"\",ŽiačkykyZáp!G8)","v":69},{"$f":"IF(ŽiačkykyZáp!H8=\"\",\"\",ŽiačkykyZáp!H8)","v":6},{"$f":"IF(ŽiačkykyZáp!I8=0,\"\",ŽiačkykyZáp!I8)","v":218},{"$f":"ŽiačkykyZáp!K8","v":"áno"}]
[null,"6.",{"$f":"IF(ŽiačkykyZáp!C9=0,\"\",ŽiačkykyZáp!C9)","v":"Pečenkárová Tatiana"},{"$f":"IF(ŽiačkykyZáp!D9=0,\"\",ŽiačkykyZáp!D9)","v":8240},{"$f":"IF(ŽiačkykyZáp!E9=0,\"\",ŽiačkykyZáp!E9)","v":"KK Pobedim"},{"$f":"IF(ŽiačkykyZáp!F9=0,\"\",ŽiačkykyZáp!F9)","v":99},{"$f":"IF(ŽiačkykyZáp!G9=0,\"\",ŽiačkykyZáp!G9)","v":41},{"$f":"IF(ŽiačkykyZáp!H9=\"\",\"\",ŽiačkykyZáp!H9)","v":21},{"$f":"IF(ŽiačkykyZáp!I9=0,\"\",ŽiačkykyZáp!I9)","v":140},{"$f":"ŽiačkykyZáp!K9","v":"áno"}]
[null,"7.",{"$f":"IF(ŽiačkykyZáp!C10=0,\"\",ŽiačkykyZáp!C10)","v":""},{"$f":"IF(ŽiačkykyZáp!D10=0,\"\",ŽiačkykyZáp!D10)","v":""},{"$f":"IF(ŽiačkykyZáp!E10=0,\"\",ŽiačkykyZáp!E10)","v":""},{"$f":"IF(ŽiačkykyZáp!F10=0,\"\",ŽiačkykyZáp!F10)","v":""},{"$f":"IF(ŽiačkykyZáp!G10=0,\"\",ŽiačkykyZáp!G10)","v":""},{"$f":"IF(ŽiačkykyZáp!H10=\"\",\"\",ŽiačkykyZáp!H10)","v":""},{"$f":"IF(ŽiačkykyZáp!I10=0,\"\",ŽiačkykyZáp!I10)","v":""},{"$f":"ŽiačkykyZáp!K10","v":"nie"}]
[null,"8.",{"$f":"IF(ŽiačkykyZáp!C11=0,\"\",ŽiačkykyZáp!C11)","v":""},{"$f":"IF(ŽiačkykyZáp!D11=0,\"\",ŽiačkykyZáp!D11)","v":""},{"$f":"IF(ŽiačkykyZáp!E11=0,\"\",ŽiačkykyZáp!E11)","v":""},{"$f":"IF(ŽiačkykyZáp!F11=0,\"\",ŽiačkykyZáp!F11)","v":""},{"$f":"IF(ŽiačkykyZáp!G11=0,\"\",ŽiačkykyZáp!G11)","v":""},{"$f":"IF(ŽiačkykyZáp!H11=\"\",\"\",ŽiačkykyZáp!H11)","v":""},{"$f":"IF(ŽiačkykyZáp!I11=0,\"\",ŽiačkykyZáp!I11)","v":""},{"$f":"ŽiačkykyZáp!K11","v":"nie"}]
[null,"9.",{"$f":"IF(ŽiačkykyZáp!C12=0,\"\",ŽiačkykyZáp!C12)","v":""},{"$f":"IF(ŽiačkykyZáp!D12=0,\"\",ŽiačkykyZáp!D12)","v":""},{"$f":"IF(ŽiačkykyZáp!E12=0,\"\",ŽiačkykyZáp!E12)","v":""},{"$f":"IF(ŽiačkykyZáp!F12=0,\"\",ŽiačkykyZáp!F12)","v":""},{"$f":"IF(ŽiačkykyZáp!G12=0,\"\",ŽiačkykyZáp!G12)","v":""},{"$f":"IF(ŽiačkykyZáp!H12=\"\",\"\",ŽiačkykyZáp!H12)","v":""},{"$f":"IF(ŽiačkykyZáp!I12=0,\"\",ŽiačkykyZáp!I12)","v":""},{"$f":"ŽiačkykyZáp!K12","v":"nie"}]
[null,"10.",{"$f":"IF(ŽiačkykyZáp!C13=0,\"\",ŽiačkykyZáp!C13)","v":""},{"$f":"IF(ŽiačkykyZáp!D13=0,\"\",ŽiačkykyZáp!D13)","v":""},{"$f":"IF(ŽiačkykyZáp!E13=0,\"\",ŽiačkykyZáp!E13)","v":""},{"$f":"IF(ŽiačkykyZáp!F13=0,\"\",ŽiačkykyZáp!F13)","v":""},{"$f":"IF(ŽiačkykyZáp!G13=0,\"\",ŽiačkykyZáp!G13)","v":""},{"$f":"IF(ŽiačkykyZáp!H13=\"\",\"\",ŽiačkykyZáp!H13)","v":""},{"$f":"IF(ŽiačkykyZáp!I13=0,\"\",ŽiačkykyZáp!I13)","v":""},{"$f":"ŽiačkykyZáp!K13","v":"nie"}]
[null,"11.",{"$f":"IF(ŽiačkykyZáp!C14=0,\"\",ŽiačkykyZáp!C14)","v":""},{"$f":"IF(ŽiačkykyZáp!D14=0,\"\",ŽiačkykyZáp!D14)","v":""},{"$f":"IF(ŽiačkykyZáp!E14=0,\"\",ŽiačkykyZáp!E14)","v":""},{"$f":"IF(ŽiačkykyZáp!F14=0,\"\",ŽiačkykyZáp!F14)","v":""},{"$f":"IF(ŽiačkykyZáp!G14=0,\"\",ŽiačkykyZáp!G14)","v":""},{"$f":"IF(ŽiačkykyZáp!H14=\"\",\"\",ŽiačkykyZáp!H14)","v":""},{"$f":"IF(ŽiačkykyZáp!I14=0,\"\",ŽiačkykyZáp!I14)","v":""},{"$f":"ŽiačkykyZáp!K14","v":"nie"}]
[null,"12.",{"$f":"IF(ŽiačkykyZáp!C15=0,\"\",ŽiačkykyZáp!C15)","v":""},{"$f":"IF(ŽiačkykyZáp!D15=0,\"\",ŽiačkykyZáp!D15)","v":""},{"$f":"IF(ŽiačkykyZáp!E15=0,\"\",ŽiačkykyZáp!E15)","v":""},{"$f":"IF(ŽiačkykyZáp!F15=0,\"\",ŽiačkykyZáp!F15)","v":""},{"$f":"IF(ŽiačkykyZáp!G15=0,\"\",ŽiačkykyZáp!G15)","v":""},{"$f":"IF(ŽiačkykyZáp!H15=\"\",\"\",ŽiačkykyZáp!H15)","v":""},{"$f":"IF(ŽiačkykyZáp!I15=0,\"\",ŽiačkykyZáp!I15)","v":""},{"$f":"ŽiačkykyZáp!K15","v":"nie"}]
[null,"13.",{"$f":"IF(ŽiačkykyZáp!C16=0,\"\",ŽiačkykyZáp!C16)","v":""},{"$f":"IF(ŽiačkykyZáp!D16=0,\"\",ŽiačkykyZáp!D16)","v":""},{"$f":"IF(ŽiačkykyZáp!E16=0,\"\",ŽiačkykyZáp!E16)","v":""},{"$f":"IF(ŽiačkykyZáp!F16=0,\"\",ŽiačkykyZáp!F16)","v":""},{"$f":"IF(ŽiačkykyZáp!G16=0,\"\",ŽiačkykyZáp!G16)","v":""},{"$f":"IF(ŽiačkykyZáp!H16=\"\",\"\",ŽiačkykyZáp!H16)","v":""},{"$f":"IF(ŽiačkykyZáp!I16=0,\"\",ŽiačkykyZáp!I16)","v":""},{"$f":"ŽiačkykyZáp!K16","v":"nie"}]
[null,"14.",{"$f":"IF(ŽiačkykyZáp!C17=0,\"\",ŽiačkykyZáp!C17)","v":""},{"$f":"IF(ŽiačkykyZáp!D17=0,\"\",ŽiačkykyZáp!D17)","v":""},{"$f":"IF(ŽiačkykyZáp!E17=0,\"\",ŽiačkykyZáp!E17)","v":""},{"$f":"IF(ŽiačkykyZáp!F17=0,\"\",ŽiačkykyZáp!F17)","v":""},{"$f":"IF(ŽiačkykyZáp!G17=0,\"\",ŽiačkykyZáp!G17)","v":""},{"$f":"IF(ŽiačkykyZáp!H17=\"\",\"\",ŽiačkykyZáp!H17)","v":""},{"$f":"IF(ŽiačkykyZáp!I17=0,\"\",ŽiačkykyZáp!I17)","v":""},{"$f":"ŽiačkykyZáp!K17","v":"nie"}]
[null,"15.",{"$f":"IF(ŽiačkykyZáp!C18=0,\"\",ŽiačkykyZáp!C18)","v":""},{"$f":"IF(ŽiačkykyZáp!D18=0,\"\",ŽiačkykyZáp!D18)","v":""},{"$f":"IF(ŽiačkykyZáp!E18=0,\"\",ŽiačkykyZáp!E18)","v":""},{"$f":"IF(ŽiačkykyZáp!F18=0,\"\",ŽiačkykyZáp!F18)","v":""},{"$f":"IF(ŽiačkykyZáp!G18=0,\"\",ŽiačkykyZáp!G18)","v":""},{"$f":"IF(ŽiačkykyZáp!H18=\"\",\"\",ŽiačkykyZáp!H18)","v":""},{"$f":"IF(ŽiačkykyZáp!I18=0,\"\",ŽiačkykyZáp!I18)","v":""},{"$f":"ŽiačkykyZáp!K18","v":"nie"}]
[null,"16.",{"$f":"IF(ŽiačkykyZáp!C19=0,\"\",ŽiačkykyZáp!C19)","v":""},{"$f":"IF(ŽiačkykyZáp!D19=0,\"\",ŽiačkykyZáp!D19)","v":""},{"$f":"IF(ŽiačkykyZáp!E19=0,\"\",ŽiačkykyZáp!E19)","v":""},{"$f":"IF(ŽiačkykyZáp!F19=0,\"\",ŽiačkykyZáp!F19)","v":""},{"$f":"IF(ŽiačkykyZáp!G19=0,\"\",ŽiačkykyZáp!G19)","v":""},{"$f":"IF(ŽiačkykyZáp!H19=\"\",\"\",ŽiačkykyZáp!H19)","v":""},{"$f":"IF(ŽiačkykyZáp!I19=0,\"\",ŽiačkykyZáp!I19)","v":""},{"$f":"ŽiačkykyZáp!K19","v":"nie"}]
[null,"17.",{"$f":"IF(ŽiačkykyZáp!C20=0,\"\",ŽiačkykyZáp!C20)","v":""},{"$f":"IF(ŽiačkykyZáp!D20=0,\"\",ŽiačkykyZáp!D20)","v":""},{"$f":"IF(ŽiačkykyZáp!E20=0,\"\",ŽiačkykyZáp!E20)","v":""},{"$f":"IF(ŽiačkykyZáp!F20=0,\"\",ŽiačkykyZáp!F20)","v":""},{"$f":"IF(ŽiačkykyZáp!G20=0,\"\",ŽiačkykyZáp!G20)","v":""},{"$f":"IF(ŽiačkykyZáp!H20=\"\",\"\",ŽiačkykyZáp!H20)","v":""},{"$f":"IF(ŽiačkykyZáp!I20=0,\"\",ŽiačkykyZáp!I20)","v":""},{"$f":"ŽiačkykyZáp!K20","v":"nie"}]
[null,"18.",{"$f":"IF(ŽiačkykyZáp!C21=0,\"\",ŽiačkykyZáp!C21)","v":""},{"$f":"IF(ŽiačkykyZáp!D21=0,\"\",ŽiačkykyZáp!D21)","v":""},{"$f":"IF(ŽiačkykyZáp!E21=0,\"\",ŽiačkykyZáp!E21)","v":""},{"$f":"IF(ŽiačkykyZáp!F21=0,\"\",ŽiačkykyZáp!F21)","v":""},{"$f":"IF(ŽiačkykyZáp!G21=0,\"\",ŽiačkykyZáp!G21)","v":""},{"$f":"IF(ŽiačkykyZáp!H21=\"\",\"\",ŽiačkykyZáp!H21)","v":""},{"$f":"IF(ŽiačkykyZáp!I21=0,\"\",ŽiačkykyZáp!I21)","v":""},{"$f":"ŽiačkykyZáp!K21","v":"nie"}]
[null,"19.",{"$f":"IF(ŽiačkykyZáp!C22=0,\"\",ŽiačkykyZáp!C22)","v":""},{"$f":"IF(ŽiačkykyZáp!D22=0,\"\",ŽiačkykyZáp!D22)","v":""},{"$f":"IF(ŽiačkykyZáp!E22=0,\"\",ŽiačkykyZáp!E22)","v":""},{"$f":"IF(ŽiačkykyZáp!F22=0,\"\",ŽiačkykyZáp!F22)","v":""},{"$f":"IF(ŽiačkykyZáp!G22=0,\"\",ŽiačkykyZáp!G22)","v":""},{"$f":"IF(ŽiačkykyZáp!H22=\"\",\"\",ŽiačkykyZáp!H22)","v":""},{"$f":"IF(ŽiačkykyZáp!I22=0,\"\",ŽiačkykyZáp!I22)","v":""},{"$f":"ŽiačkykyZáp!K22","v":"nie"}]
[null,"20.",{"$f":"IF(ŽiačkykyZáp!C23=0,\"\",ŽiačkykyZáp!C23)","v":""},{"$f":"IF(ŽiačkykyZáp!D23=0,\"\",ŽiačkykyZáp!D23)","v":""},{"$f":"IF(ŽiačkykyZáp!E23=0,\"\",ŽiačkykyZáp!E23)","v":""},{"$f":"IF(ŽiačkykyZáp!F23=0,\"\",ŽiačkykyZáp!F23)","v":""},{"$f":"IF(ŽiačkykyZáp!G23=0,\"\",ŽiačkykyZáp!G23)","v":""},{"$f":"IF(ŽiačkykyZáp!H23=\"\",\"\",ŽiačkykyZáp!H23)","v":""},{"$f":"IF(ŽiačkykyZáp!I23=0,\"\",ŽiačkykyZáp!I23)","v":""},{"$f":"ŽiačkykyZáp!K23","v":"nie"}]
[null,"21.",{"$f":"IF(ŽiačkykyZáp!C24=0,\"\",ŽiačkykyZáp!C24)","v":""},{"$f":"IF(ŽiačkykyZáp!D24=0,\"\",ŽiačkykyZáp!D24)","v":""},{"$f":"IF(ŽiačkykyZáp!E24=0,\"\",ŽiačkykyZáp!E24)","v":""},{"$f":"IF(ŽiačkykyZáp!F24=0,\"\",ŽiačkykyZáp!F24)","v":""},{"$f":"IF(ŽiačkykyZáp!G24=0,\"\",ŽiačkykyZáp!G24)","v":""},{"$f":"IF(ŽiačkykyZáp!H24=\"\",\"\",ŽiačkykyZáp!H24)","v":""},{"$f":"IF(ŽiačkykyZáp!I24=0,\"\",ŽiačkykyZáp!I24)","v":""},{"$f":"ŽiačkykyZáp!K24","v":"nie"}]
[null,"22.",{"$f":"IF(ŽiačkykyZáp!C25=0,\"\",ŽiačkykyZáp!C25)","v":""},{"$f":"IF(ŽiačkykyZáp!D25=0,\"\",ŽiačkykyZáp!D25)","v":""},{"$f":"IF(ŽiačkykyZáp!E25=0,\"\",ŽiačkykyZáp!E25)","v":""},{"$f":"IF(ŽiačkykyZáp!F25=0,\"\",ŽiačkykyZáp!F25)","v":""},{"$f":"IF(ŽiačkykyZáp!G25=0,\"\",ŽiačkykyZáp!G25)","v":""},{"$f":"IF(ŽiačkykyZáp!H25=\"\",\"\",ŽiačkykyZáp!H25)","v":""},{"$f":"IF(ŽiačkykyZáp!I25=0,\"\",ŽiačkykyZáp!I25)","v":""},{"$f":"ŽiačkykyZáp!K25","v":"nie"}]
[null,"23.",{"$f":"IF(ŽiačkykyZáp!C26=0,\"\",ŽiačkykyZáp!C26)","v":""},{"$f":"IF(ŽiačkykyZáp!D26=0,\"\",ŽiačkykyZáp!D26)","v":""},{"$f":"IF(ŽiačkykyZáp!E26=0,\"\",ŽiačkykyZáp!E26)","v":""},{"$f":"IF(ŽiačkykyZáp!F26=0,\"\",ŽiačkykyZáp!F26)","v":""},{"$f":"IF(ŽiačkykyZáp!G26=0,\"\",ŽiačkykyZáp!G26)","v":""},{"$f":"IF(ŽiačkykyZáp!H26=\"\",\"\",ŽiačkykyZáp!H26)","v":""},{"$f":"IF(ŽiačkykyZáp!I26=0,\"\",ŽiačkykyZáp!I26)","v":""},{"$f":"ŽiačkykyZáp!K26","v":"nie"}]
[null,"24.",{"$f":"IF(ŽiačkykyZáp!C27=0,\"\",ŽiačkykyZáp!C27)","v":""},{"$f":"IF(ŽiačkykyZáp!D27=0,\"\",ŽiačkykyZáp!D27)","v":""},{"$f":"IF(ŽiačkykyZáp!E27=0,\"\",ŽiačkykyZáp!E27)","v":""},{"$f":"IF(ŽiačkykyZáp!F27=0,\"\",ŽiačkykyZáp!F27)","v":""},{"$f":"IF(ŽiačkykyZáp!G27=0,\"\",ŽiačkykyZáp!G27)","v":""},{"$f":"IF(ŽiačkykyZáp!H27=\"\",\"\",ŽiačkykyZáp!H27)","v":""},{"$f":"IF(ŽiačkykyZáp!I27=0,\"\",ŽiačkykyZáp!I27)","v":""},{"$f":"ŽiačkykyZáp!K27","v":"nie"}]
[null,"25.",{"$f":"IF(ŽiačkykyZáp!C28=0,\"\",ŽiačkykyZáp!C28)","v":""},{"$f":"IF(ŽiačkykyZáp!D28=0,\"\",ŽiačkykyZáp!D28)","v":""},{"$f":"IF(ŽiačkykyZáp!E28=0,\"\",ŽiačkykyZáp!E28)","v":""},{"$f":"IF(ŽiačkykyZáp!F28=0,\"\",ŽiačkykyZáp!F28)","v":""},{"$f":"IF(ŽiačkykyZáp!G28=0,\"\",ŽiačkykyZáp!G28)","v":""},{"$f":"IF(ŽiačkykyZáp!H28=\"\",\"\",ŽiačkykyZáp!H28)","v":""},{"$f":"IF(ŽiačkykyZáp!I28=0,\"\",ŽiačkykyZáp!I28)","v":""},{"$f":"ŽiačkykyZáp!K28","v":"nie"}]
[null,"26.",{"$f":"IF(ŽiačkykyZáp!C29=0,\"\",ŽiačkykyZáp!C29)","v":""},{"$f":"IF(ŽiačkykyZáp!D29=0,\"\",ŽiačkykyZáp!D29)","v":""},{"$f":"IF(ŽiačkykyZáp!E29=0,\"\",ŽiačkykyZáp!E29)","v":""},{"$f":"IF(ŽiačkykyZáp!F29=0,\"\",ŽiačkykyZáp!F29)","v":""},{"$f":"IF(ŽiačkykyZáp!G29=0,\"\",ŽiačkykyZáp!G29)","v":""},{"$f":"IF(ŽiačkykyZáp!H29=\"\",\"\",ŽiačkykyZáp!H29)","v":""},{"$f":"IF(ŽiačkykyZáp!I29=0,\"\",ŽiačkykyZáp!I29)","v":""},{"$f":"ŽiačkykyZáp!K29","v":"nie"}]
[null,"27.",{"$f":"IF(ŽiačkykyZáp!C30=0,\"\",ŽiačkykyZáp!C30)","v":""},{"$f":"IF(ŽiačkykyZáp!D30=0,\"\",ŽiačkykyZáp!D30)","v":""},{"$f":"IF(ŽiačkykyZáp!E30=0,\"\",ŽiačkykyZáp!E30)","v":""},{"$f":"IF(ŽiačkykyZáp!F30=0,\"\",ŽiačkykyZáp!F30)","v":""},{"$f":"IF(ŽiačkykyZáp!G30=0,\"\",ŽiačkykyZáp!G30)","v":""},{"$f":"IF(ŽiačkykyZáp!H30=\"\",\"\",ŽiačkykyZáp!H30)","v":""},{"$f":"IF(ŽiačkykyZáp!I30=0,\"\",ŽiačkykyZáp!I30)","v":""},{"$f":"ŽiačkykyZáp!K30","v":"nie"}]
[null,"28.",{"$f":"IF(ŽiačkykyZáp!C31=0,\"\",ŽiačkykyZáp!C31)","v":""},{"$f":"IF(ŽiačkykyZáp!D31=0,\"\",ŽiačkykyZáp!D31)","v":""},{"$f":"IF(ŽiačkykyZáp!E31=0,\"\",ŽiačkykyZáp!E31)","v":""},{"$f":"IF(ŽiačkykyZáp!F31=0,\"\",ŽiačkykyZáp!F31)","v":""},{"$f":"IF(ŽiačkykyZáp!G31=0,\"\",ŽiačkykyZáp!G31)","v":""},{"$f":"IF(ŽiačkykyZáp!H31=\"\",\"\",ŽiačkykyZáp!H31)","v":""},{"$f":"IF(ŽiačkykyZáp!I31=0,\"\",ŽiačkykyZáp!I31)","v":""},{"$f":"ŽiačkykyZáp!K31","v":"nie"}]
[null,"29.",{"$f":"IF(ŽiačkykyZáp!C32=0,\"\",ŽiačkykyZáp!C32)","v":""},{"$f":"IF(ŽiačkykyZáp!D32=0,\"\",ŽiačkykyZáp!D32)","v":""},{"$f":"IF(ŽiačkykyZáp!E32=0,\"\",ŽiačkykyZáp!E32)","v":""},{"$f":"IF(ŽiačkykyZáp!F32=0,\"\",ŽiačkykyZáp!F32)","v":""},{"$f":"IF(ŽiačkykyZáp!G32=0,\"\",ŽiačkykyZáp!G32)","v":""},{"$f":"IF(ŽiačkykyZáp!H32=\"\",\"\",ŽiačkykyZáp!H32)","v":""},{"$f":"IF(ŽiačkykyZáp!I32=0,\"\",ŽiačkykyZáp!I32)","v":""},{"$f":"ŽiačkykyZáp!K32","v":"nie"}]
[null,"30.",{"$f":"IF(ŽiačkykyZáp!C33=0,\"\",ŽiačkykyZáp!C33)","v":""},{"$f":"IF(ŽiačkykyZáp!D33=0,\"\",ŽiačkykyZáp!D33)","v":""},{"$f":"IF(ŽiačkykyZáp!E33=0,\"\",ŽiačkykyZáp!E33)","v":""},{"$f":"IF(ŽiačkykyZáp!F33=0,\"\",ŽiačkykyZáp!F33)","v":""},{"$f":"IF(ŽiačkykyZáp!G33=0,\"\",ŽiačkykyZáp!G33)","v":""},{"$f":"IF(ŽiačkykyZáp!H33=\"\",\"\",ŽiačkykyZáp!H33)","v":""},{"$f":"IF(ŽiačkykyZáp!I33=0,\"\",ŽiačkykyZáp!I33)","v":""},{"$f":"ŽiačkykyZáp!K33","v":"nie"}]